{"text_format":"3","workbook":"xlsx","n_sheets":7,"sheets":["I1_Explications","E1_Données de projet","E2_Prix de la chaleur","E3_Consommateurs","B1_Calculs","A1_Résultats","A2_Données VAN"],"not_rendered":{"charts":6,"images":2,"defined_names":280,"comments":1},"read":"whole","date_system":"1900"}

{"sheet":"I1_Explications","index":0,"n_rows":219,"n_cols":2,"rows_kept":219}
[null,"Explications au sujet du modèle de rentabilité de QM Chauffages au bois"]
[null,"Version: 5.1 (mai 2022)"]
[null,"Explications"]
[null,"Généralités au sujet de cet outil:\nExclusion de responsabilité\nMalgré tout le soin apporté à l’élaboration de cet outil Excel, ses concepteurs ne peuvent donner aucune garantie concernant les résultats obtenus et les conclusions qui en sont tirées. Les simplifications et le mode de calcul retenus peuvent entraîner certaines «erreurs». L’outil ne distingue p. ex. pas si les paiements sont effectués en début ou en fin d’année, étant donné qu’une année est considérée comme une période globale.\nAttention: Bien que l’outil affiche des messages d’alerte en cas de non respect de diverses limites de saisie, il n’est pas exclu que la saisie de valeurs erronées conduise à l’obtention d’un résultat final également erroné. Il appartient à l’utilisateur de l’outil d’évaluer de façon appropriée les conséquences d’un certain nombre d’hypothèses.\n\nFormules:\nLes feuilles de calcul de ce classeur sont protégées en écriture, mais l’ensemble des formules et calculs sont néanmoins visibles. Notez bien que toute modification peut entraîner des erreurs en d’autres emplacements et, par conséquent, à des assertions erronées de l’outil.\n\nAnalyse de sensibilité / calculs de simulation:\nEn faisant varier les paramètres de saisie et en enregistrant les résultats individuels des \ncalculs de rentabilité, il est possible d’obtenir des informations concernant l’influence des \nparamètres individuels sur l’évolution économique du projet.\n\nFeed-back:\nL’équipe de QM Chauffages au bois sera ravie de toute suggestion d’amélioration ou idée concernant \ncet outil, que vous lui transmettrez à l’adresse info@qmholzheizwerke.ch"]
[null,"Remerciements\nLe présent outil a été élaboré sur mandat de SuisseEnergie."]
[null,"Onglets: Le fichier est divisé en plusieurs onglets\nDénomination: les dénominations des onglets distinguent également leur principale fonction:\nI = Information (feuille comportant des informations et des explications sur l’utilisation du fichier)\nE = Feuille de saisie (saisie de données requises pour les calculs)\nB = Calcul\nA = Feuille de sortie (présentation de résultats sélectionnés en vue de les imprimer ou d’exporter les données)"]
[100,"Onglet «E1_Données de projet»\nSaisie de données de projet, délais, coûts d’investissement, subventions, prêts, frais d’exploitation, etc."]
[101,"Les champs de saisie sont affichés sur fond jaune clair."]
[102,"Les champs de saisie avec des valeurs standard et/ou des calculs sont affichés sur fond bleu clair.\nNotez bien que toute modification de ces champs peut entraîner des erreurs en d’autres emplacements et, par conséquent, à des assertions erronées de l’outil."]
[103,"Champs de saisie dans lesquels peuvent être reprises des données issues du fichier Excel QMCB Relevé de situation.\nRemarque: pour éviter de copier les formules, utilisez la fonction «Coller - Valeurs»."]
[104,"Champs de résultat dont le contenu peut être copié et inséré dans un fichier externe\nCes champs sont modifiables. Notez bien que toute modification de ces champs peut entraîner des erreurs en d’autres emplacements et, par conséquent, à des résultats erronés."]
[105,"Tous les montants en CHF doivent être indiqués hors TVA."]
[106,"Champ de saisie pour le nom et la désignation du projet et/ou de la variante"]
[107,"Personne en charge de l’édition du modèle de rentabilité"]
[108,"Avertissements: Un court texte explicatif apparaît dans le champ Avertissements en cas de saisie de valeurs non plausibles (p. ex. déperditions du réseau = 80 % ou similaire)"]
[110,"Chapitre Quantité de chaleur, déperditions du réseau et informations générales sur le projet"]
[111,"Quantité de chaleur vendue en MWh pour un degré de consommation de chaleur de 100 %. (Calculée à partir de la somme des consommateurs de chaleur de l’onglet «Consommateurs»)"]
[112,"Déperditions du réseau de chaleur à distance (exigence QMCB ≤ 10 %). Rapport entre la différence entre chaleur produite et vendue d’une part et la quantité de chaleur vendue d’autre part. Pour les réseaux en cours d’extension, il convient d’indiquer au mieux une déperdition moyenne."]
[113,"Diminution annuelle des besoins de chaleur. Diminution annuelle moyenne des besoins de chaleur par des mesures d’efficacité (p.ex. Amélioration de l’enveloppe des bâtiments, de l’isolation) des consommateurs de chaleur depuis la mise en service. Cette valeur est prise en compte dans les besoins totaux de chaleur."]
[114,"Année de base pour les investissements: utilisée comme année 0 pour les calculs de rentabilité."]
{"$rows_left_out":200}
{"sheet":"E1_Données de projet","index":1,"n_rows":105,"n_cols":23,"rows_kept":105}
[100,"QM Chauffages au bois - Modèle de rentabilité - Données de projet"]
[]
[101,null,"Champ de saisie",{"$nulls":9},"Commentaires"]
[102,null,"Valeur standard ou calcul (modifiable)"]
[105,"(hors TVA)"]
[]
[106,"Projet/Variante :"]
[]
[]
[]
[107,"Saisi par :"]
[]
[108,"Avertissements\nRemarques :",{"$f":"IF(S13>10,T14,IF(S13>0,T13,\"\"))","v":"Plus de 10 remarques !"},{"$nulls":15},{"$f":"COUNTIF(Q16:S120,\">0\")","v":21},{"$f":"T16&T24&T34&T47&T62&T74&T68","v":"111: La consommation de chaleur est trop faible ! 113: Aucune diminution des besoins de chaleur saisi. 114: L'année de démarrage du projet est antérieure à 2000. 122: La part de la chaleur annuelle issue de la biomasse est insignifiante. 124: Le prix du combustible fossile est trop bas. 127: Le prix de l'électricité est supposé très faible. 127: Le prix de l'électricité est nul. 125: Le taux d'utilisation annuel de la chaudière est inférieur à 40 %. 130: Les coûts annuels de personnel sont très faibles. 131: Les coûts d'exploitation externes annuels sont très faibles.132: Les frais d'entretien annuels sont très faibles. 135: Les frais annuels de propriété ont été supposés très bas. 136: Les autres frais sont très faibles. 151: Les frais de construction de la centrale de chauffage sont très faibles. 154: Les frais des installations de la centrale sont très faibles. 155: Les frais de construction du réseau de chaleur sont très faibles. 157: Les frais pour les postes intérieurs sont très faibles. 152: Les frais des éléments de l'installation spécifiques au bois sont très faibles. 153: Les frais des éléments de l'installation spécifiques à la charge de pointe sont très faibles. 156: Les frais de comptage de la chaleur sont très faibles. "}]
[{"$nulls":19},"Plus de 10 remarques !"]
[{"$nulls":14},"Min","Max","Unters.","Übers.","S.Fehler","Avertissement","TexteMin","TexteMax","TexteAutre"]
[110,"Quantité de chaleur, réseau, lancement du projet",{"$nulls":17},{"$f":"T17&T18&T19&T21&T22","v":"111: La consommation de chaleur est trop faible ! 113: Aucune diminution des besoins de chaleur saisi. 114: L'année de démarrage du projet est antérieure à 2000. "}]
[111,null,"Consommation de chaleur totale des utilisateurs",{"$f":"SUM(E3_Consommateurs!D18:XFD18)","v":0},"MWh/an",{"$nulls":9},10,9999999999,{"$f":"IF($D17<O17,1,0)","v":1},{"$f":"IF($D17>P17,1,0)","v":0},0,{"$f":"IF(Q17=1,U17,IF(R17=1,V17,IF(S17=1,W17,\"\")))","v":"111: La consommation de chaleur est trop faible ! "},"111: La consommation de chaleur est trop faible ! ","111: La consommation de chaleur est trop grande."]
[112,null,"Déperditions du réseau",10,"%",{"$nulls":9},0,20,{"$f":"IF($D18<O18,1,0)","v":0},{"$f":"IF($D18>P18,1,0)","v":0},{"$f":"IF(D18=\"\",1,0)","v":0},{"$f":"IF(Q18>0,U18,\"\")&IF(R18>0,V18,\"\")&IF(S18>0,W18,\"\")","v":""},"112: Les déperditions du réseau de chaleur sont trop faibles !","112: Les déperditions du réseau de chaleur sont trop élevées !","112: Pas de déperditions de réseau saisies."]
[113,null,"Diminution des besoins de chaleur (Amélioration de l’enveloppe du bâtiment)",null,"%",{"$nulls":9},0,5,{"$f":"IF($D19<O19,1,0)","v":0},{"$f":"IF($D19>P19,1,0)","v":0},{"$f":"IF(D19=\"\",1,0)","v":1},{"$f":"IF(Q19>0,U19,\"\")&IF(R19>0,V19,\"\")&IF(S19>0,W19,\"\")","v":"113: Aucune diminution des besoins de chaleur saisi. "},"113: La diminution des besoins de chaleur des consommateurs de chaleur est négative ; surconsommation. ","113: La diminution des besoins de chaleur est très élevée. ","113: Aucune diminution des besoins de chaleur saisi. "]
[]
{"$rows_left_out":86}
{"sheet":"E2_Prix de la chaleur","index":2,"n_rows":35,"n_cols":11,"rows_kept":35,"merged":[[5,3,5,8],[6,3,6,8],[7,3,7,8],[9,3,9,8]]}
[200,"QM Chauffages au bois - Modèle de rentabilité - Prix de la chaleur "]
[]
[101,null,null,"Champ de saisie"]
[105,"(hors TVA)"]
[]
[206,"Projet/Variante :",null,{"$f":"IF('E1_Données de projet'!C7=0,\"\",'E1_Données de projet'!C7)","v":""}]
[{"$nulls":3},{"$f":"IF('E1_Données de projet'!C8=0,\"\",'E1_Données de projet'!C8)","v":""}]
[{"$nulls":3},{"$f":"IF('E1_Données de projet'!C9=0,\"\",'E1_Données de projet'!C9)","v":""}]
[]
[207,"Saisi par :",null,{"$f":"IF('E1_Données de projet'!C11=0,\"\",'E1_Données de projet'!C11)","v":""}]
[]
[210,"Saisie du prix de base et du prix de consommation",{"$nulls":8},"Commentaires"]
[]
[211,"Tarif 1",{"$nulls":4},{"$f":"SUMPRODUCT(E3_Consommateurs!$D$18:$XFD$18*(E3_Consommateurs!$D$22:$XFD$22=\"T 1: \"&Eing_Abnehmerart1))/Eing_verkaufteWM*100","v":{"$error":"#DIV/0!"}},"% de la quantité de chaleur"]
[212,{"$nulls":4},"prix de base annuel",null,"CHF/kW an"]
[213,{"$nulls":4},"prix de consommation",null,"CHF/kWh"]
[214,{"$nulls":4},"durée contractuelle",null,"ans"]
[]
[]
[221,"Tarif 2",{"$nulls":4},{"$f":"SUMPRODUCT(E3_Consommateurs!$D$18:$XFD$18*(E3_Consommateurs!$D$22:$XFD$22=\"T 2: \"&Eing_Abnehmerart2))/Eing_verkaufteWM*100","v":{"$error":"#DIV/0!"}},"% de la quantité de chaleur"]
{"$rows_left_out":16}
{"sheet":"E3_Consommateurs","index":3,"n_rows":38,"n_cols":183,"rows_kept":38}
[300,"QM Chauffages au bois - Modèle de rentabilité - Saisie des consommateurs"]
[]
[101,null,"Champ de saisie"]
[102,null,"Valeur standard ou calcul (modifiable)"]
[103,null,"Champ transmis depuis le relevé de situation"]
[206,"Projet/Variante :",""]
[null,null,""]
[null,null,""]
[]
[207,"Saisi par :",""]
[]
[310,"Indications concernant les consommateurs"]
[]
[311,"Généralités","Numéro"]
[312,null,"Désignation"]
[null,null," "]
[null,null," "]
[320,"Besoin de chaleur","Besoin total de chaleur [MWh/an]"]
[321,null,"Puissance souscrite [kW]"]
[322,"Raccordement","Date de raccordement"]
{"$rows_left_out":19}
{"sheet":"B1_Calculs","index":4,"n_rows":60,"n_cols":36,"rows_kept":60,"merged":[[2,3,2,8],[3,3,3,8],[5,3,5,8],[6,3,6,8],[7,3,7,8],[9,3,9,8],[11,3,11,8],[14,1,14,4],[15,2,15,4],[16,2,16,4],[17,2,17,4],[18,2,18,4],[19,2,19,4],[20,2,20,4],[21,2,21,4],[22,2,22,4],[26,2,26,4],[27,2,27,4],[28,2,28,4]]}
[500,"QM Chauffages au bois - Modèle de rentabilité - Résultat"]
[]
[101,null,null,"Champ de saisie"]
[102,null,null,"Valeur standard ou calculée (modifiable)"]
[]
[206,"Projet/Variante :",null,{"$f":"IF('E1_Données de projet'!C7=0,\"\",'E1_Données de projet'!C7)","v":""},{"$nulls":5},590,"Évolution économique (graphique)",{"$nulls":10},591,"Évolution état du crédit / valeur résiduelle (graphique)"]
[{"$nulls":3},{"$f":"IF('E1_Données de projet'!C8=0,\"\",'E1_Données de projet'!C8)","v":""}]
[{"$nulls":3},{"$f":"IF('E1_Données de projet'!C9=0,\"\",'E1_Données de projet'!C9)","v":""}]
[]
[207,"Saisi par :",null,{"$f":"IF('E1_Données de projet'!C11=0,\"\",'E1_Données de projet'!C11)","v":""}]
[]
[501,"Avertissements :",null,{"$f":"IF('E1_Données de projet'!C13<>\"\",\"Il y a des avertissements dans le registre 'E1_Données de projet'!\",\"\")","v":"Il y a des avertissements dans le registre 'E1_Données de projet'!"}]
[{"$nulls":6},505]
[510,"Coûts d'exploitation",null,null," (utilisation à 100 % ; année 1)"," [CHF/an]","Augmentation [%]"]
[511,"Total des coûts d'exploitation",{"$nulls":3},{"$f":"SUM(F16:F23)","v":0},{"$f":"IF(F15=0,0,(F16*G16+F17*G17+F19*G19+F18*G18+F20*G20+F21*G21+F22*G22+F23*G23)/(SUM(F16:F23)))","v":{"v":0,"d":"0.00%"}}]
[512,null,"Combustible biomasse",null,null,{"$f":"Eing_Rohstoffpreis_Biomasse*Eingesetzte_Brennstoffwärme_Biomasse","v":0},{"$f":"Eing_allg_Teuerung/100","v":{"v":0,"d":"0.00%"}}]
[513,null,"Combustible fossile",null,null,{"$f":"Eingesetzte_Brennstoffwärme_fossil*Eing_Rohstoffpreis_fossil","v":0},{"v":0,"d":"0.00%"}]
[514,null,"Électricité",null,null,{"$f":"järhliche_Stromkosten","v":0},{"v":0,"d":"0.00%"}]
[515,null,"Coûts d'exploitation",null,null,{"$f":"Eing_Betriebskosten","v":0},{"v":0,"d":"0.00%"}]
[516,null,"Administration",null,null,{"$f":"Eing_Administration","v":0},{"$f":"Eing_allg_Teuerung/100","v":{"v":0,"d":"0.00%"}}]
{"$rows_left_out":41}
{"sheet":"A1_Résultats","index":5,"n_rows":42,"n_cols":14,"rows_kept":42,"merged":[[11,2,11,6],[42,7,58,12]]}
[600,"QM Chauffages au bois - Modèle de rentabilité - Résultats",{"$nulls":5},"QM Chauffages au bois - Modèle de rentabilité - Résultats"]
[]
[101,null,"Champ de saisie",{"$nulls":4},"Énergie",null,{"$f":"D32","v":0},{"$f":"E32","v":0},{"$f":"\"jusqu'à \"&B1_Calculs!B60","v":"jusqu'à 24"},null,650]
[105,"(hors TVA)",{"$nulls":6},"Charge du réseau",{"$f":"VLOOKUP(A1_Résultats!J$3,B1_Calculs!$B$36:$AH$60,3)/100","v":{"v":0,"d":"0%"}},{"$f":"VLOOKUP(A1_Résultats!K$3,B1_Calculs!$B$36:$AH$60,3)/100","v":{"v":0,"d":"0%"}},null,null,553]
[{"$nulls":8},"Quantité de chaleur fournie",{"$f":"(VLOOKUP(A1_Résultats!J$3,B1_Calculs!$B$36:$AH$60,2))*((100-Eing_Netzverluste))/100","v":0},{"$f":"(VLOOKUP(A1_Résultats!K$3,B1_Calculs!$B$36:$AH$60,2))*((100-Eing_Netzverluste))/100","v":0},{"$f":"SUM(B1_Calculs!C36:C60)*((100-Eing_Netzverluste))/100","v":0},"MWh/an",651]
[106,"Projet/Variante :",{"$f":"IF('E1_Données de projet'!C7=0,\"\",'E1_Données de projet'!C7)","v":""},{"$nulls":5},"Coût moyen sur la base des ventes de chaleur",{"$f":"(VLOOKUP(A1_Résultats!J$3,B1_Calculs!$B$36:$AH$60,14))/J5","v":{"$error":"#DIV/0!"}},{"$f":"(VLOOKUP(A1_Résultats!K$3,B1_Calculs!$B$36:$AH$60,14))/K5","v":{"$error":"#DIV/0!"}},{"$f":"SUM(B1_Calculs!O36:O60)/L5","v":{"$error":"#DIV/0!"}},"CHF/MWh",652]
[null,null,{"$f":"IF('E1_Données de projet'!C8=0,\"\",'E1_Données de projet'!C8)","v":""}]
[null,null,{"$f":"IF('E1_Données de projet'!C9=0,\"\",'E1_Données de projet'!C9)","v":""},{"$nulls":4},"Évolution de la charge du réseau",{"$nulls":5},653]
[]
[107,"Saisi par :",{"$f":"IF('E1_Données de projet'!C11=0,\"\",'E1_Données de projet'!C11)","v":""}]
[]
[501,"Avertissements :",{"$f":"IF('E1_Données de projet'!C13<>\"\",\"Il y a des avertissements dans le registre 'E1_Données de projet'!\",\"\")","v":"Il y a des avertissements dans le registre 'E1_Données de projet'!"}]
[]
[110,"Quantité de chaleur, réseau, lancement du projet"]
[111,null,"Consommation de chaleur totale des utilisateurs",{"$f":"Eing_verkaufteWM","v":0},"MWh/an"]
[112,null,"Déperditions du réseau",{"$f":"Eing_Netzverluste","v":10},"%"]
[]
[114,null,"Année de démarrage du projet",{"$f":"Eing_Beginnjahr","v":0}]
[115,null,"Année de mise en service / première fourniture de chaleur",{"$f":"'E1_Données de projet'!D22","v":0}]
[]
{"$rows_left_out":23}
{"sheet":"A2_Données VAN","index":6,"n_rows":80,"n_cols":22,"rows_kept":80,"merged":[[6,2,7,2],[6,3,7,3],[6,4,7,4],[6,5,7,5]]}
[900,"QM Chauffages au bois - Synthèse pour KliK-Tool \"Justification de l’additionnalité de projets de chaleur à distance\""]
[]
[104,null,"Champs de résultat"]
[]
[910,"Onglet Paramètres de saisie ; section Évolution de référence"]
[911,null,"Clients clé (ou groupe de clients clé présentant les mêmes caractéristiques)"]
[null,null,"Désignation","Type de bâtiment & caractéristiques de consommation","Puissance [kW]","Besoins annuels de chaleur [MWh/an]"]
[]
[null,null,{"$f":"E3_Consommateurs!$D15","v":0},null,{"$f":"E3_Consommateurs!$D19","v":0},{"$f":"E3_Consommateurs!$D18","v":0}]
[null,null,{"$f":"E3_Consommateurs!$E15","v":0},null,{"$f":"E3_Consommateurs!$E19","v":0},{"$f":"E3_Consommateurs!$E18","v":0}]
[null,null,{"$f":"E3_Consommateurs!$F15","v":0},null,{"$f":"E3_Consommateurs!$F19","v":0},{"$f":"E3_Consommateurs!$F18","v":0}]
[null,null,{"$f":"E3_Consommateurs!$G15","v":0},null,{"$f":"E3_Consommateurs!$G19","v":0},{"$f":"E3_Consommateurs!$G18","v":0}]
[null,null,{"$f":"E3_Consommateurs!$H15","v":0},null,{"$f":"E3_Consommateurs!$H19","v":0},{"$f":"E3_Consommateurs!$H18","v":0}]
[null,null,{"$f":"E3_Consommateurs!$I15","v":0},null,{"$f":"E3_Consommateurs!$I19","v":0},{"$f":"E3_Consommateurs!$I18","v":0}]
[null,null,{"$f":"E3_Consommateurs!$J15","v":0},null,{"$f":"E3_Consommateurs!$J19","v":0},{"$f":"E3_Consommateurs!$J18","v":0}]
[null,null,{"$f":"E3_Consommateurs!$K15","v":0},null,{"$f":"E3_Consommateurs!$K19","v":0},{"$f":"E3_Consommateurs!$K18","v":0}]
[null,null,{"$f":"E3_Consommateurs!$L15","v":0},null,{"$f":"E3_Consommateurs!$L19","v":0},{"$f":"E3_Consommateurs!$L18","v":0}]
[null,null,{"$f":"E3_Consommateurs!$M15","v":0},null,{"$f":"E3_Consommateurs!$M19","v":0},{"$f":"E3_Consommateurs!$M18","v":0}]
[null,null,{"$f":"E3_Consommateurs!$N15","v":0},null,{"$f":"E3_Consommateurs!$N19","v":0},{"$f":"E3_Consommateurs!$N18","v":0}]
[null,null,{"$f":"E3_Consommateurs!$O15","v":0},null,{"$f":"E3_Consommateurs!$O19","v":0},{"$f":"E3_Consommateurs!$O18","v":0}]
{"$rows_left_out":60}