{"text_format":"1","workbook":"xlsx","n_sheets":15,"sheets":["Verbraucher","Allgemeine Angaben","Wärmezentrale","Bilder","Figures","Bilder_IT","Immagini","Images","Text","Hilfsblatt","Klimadaten","AT-Vergleichsdaten","Q-Plan Tabelle","AT-Vergleich","Aenderungsprotokoll"],"not_rendered":{"charts":31,"images":0,"macros":1,"external_links":0,"defined_names":13,"comments":0,"pivot_tables":0},"unopened":[],"bounds":{"document_bytes":16777216,"sheet_cells":100000,"rows_first":2000,"rows_last":500,"rows_between":2000,"halvings":0,"cell_chars":16384,"cell_head_chars":4096},"cells_cut":0,"cells_raw":0,"read":"whole","date_system":"1900"}

{"sheet":"Verbraucher","index":0,"n_rows":54,"n_cols":256,"rows_kept":54,"cut":false,"hidden":false,"merged":[]}
[{"$f":"Text!C2","v":"QM Chauffages au bois - Relevée de situation"}]
[]
[{"$f":"Text!C3","v":"Projet/Variante:"},{"$f":"Text!C5","v":"Exemple modèle (ligne 1)"}]
[null,{"$f":"Text!C6","v":"Exemple modèle (ligne 2)"}]
[null,{"$f":"Text!C7","v":"Exemple modèle (ligne 3)"}]
[{"$f":"Text!C4","v":"Saisi par: "},{"$f":"Text!C8","v":"Concepteur modèle"}]
[{"$f":"Text!C20","v":"Date:"},"2022-02-18"]
[]
[{"$f":"Text!C9","v":"Données planificateur principale"}]
[]
[{"$f":"Text!C10","v":"Généralités"},{"$f":"Text!C11","v":"Numéro"},1,{"$f":"IF(AND(ISBLANK(C23)=TRUE,ISBLANK(C24)=TRUE,ISBLANK(C27)=TRUE,ISBLANK(C28)=TRUE,ISBLANK(C29)=TRUE,ISBLANK(C30)=TRUE),\"\",C11+1)","v":2},{"$f":"IF(AND(ISBLANK(D23)=TRUE,ISBLANK(D24)=TRUE,ISBLANK(D27)=TRUE,ISBLANK(D28)=TRUE,ISBLANK(D29)=TRUE,ISBLANK(D30)=TRUE),\"\",D11+1)","v":3},4,5,"","","","","","","","","","","","","","","","","","","","","","","","","","","","","","","","","","","","","","","","","","","","","","","","","","","","","","","","","","","","","",{"$f":"IF(AND(ISBLANK(BP23)=TRUE,ISBLANK(BP24)=TRUE,ISBLANK(BP27)=TRUE,ISBLANK(BP28)=TRUE,ISBLANK(BP29)=TRUE,ISBLANK(BP30)=TRUE),\"\",BP11+1)","v":""},"","","","","","","","","","","","","","","","","","","","","","","","","","","","","","","","","","","","","","","","","","","","","","","","","","","","","","","","","","","","","","","",{"$f":"IF(AND(ISBLANK(EB23)=TRUE,ISBLANK(EB24)=TRUE,ISBLANK(EB27)=TRUE,ISBLANK(EB28)=TRUE,ISBLANK(EB29)=TRUE,ISBLANK(EB30)=TRUE),\"\",EB11+1)","v":""},"","","","","","","","","","","","","","","","","","","","","","","","","","","","","","","","","","","","","","","","","","","","","","","","","","","","","","","","","","","","","","","",{"$f":"IF(AND(ISBLANK(GN23)=TRUE,ISBLANK(GN24)=TRUE,ISBLANK(GN27)=TRUE,ISBLANK(GN28)=TRUE,ISBLANK(GN29)=TRUE,ISBLANK(GN30)=TRUE),\"\",GN11+1)","v":""},"","","","","","","","","","","","","","","","","","","","","","","","","","","","","","","","","","","","","","","","","","","","","","","","","","","","","","","","","","",""]
[null,{"$f":"Text!C12","v":"Indication"},{"$f":"Text!C114","v":"Bâtiment ancien"},{"$f":"Text!C119","v":"Ecole existente"},{"$f":"Text!C122","v":"Chaleur industrielle"},{"$f":"Text!C116","v":"Nouveau bâtiment"}]
[]
[]
[]
[]
[]
[]
[null,{"$f":"Text!C21","v":"Détermination du besoin de chaleur au moyen de"},{"$f":"Text!C115","v":"Livraison de mazout"},{"$f":"Text!C120","v":"Décompte"},{"$f":"Text!C123","v":"Mesure"},{"$f":"Text!C117","v":"Norme SIA "}]
[null,{"$f":"Text!C22","v":"Surface de référence énergétique [m²]"},20000,10000,null,400]
[null,{"$f":"Text!C23","v":"Température aller max. [°C]"},70,75,80,65]
[null,{"$f":"Text!C24","v":"Température retour max. [°C]"},50,55,60,30]
[{"$f":"Text!C25","v":"Chaleur ambiante"},{"$f":"Text!C26","v":"Besoin de chaleur [MWh/a]"},2000,780,null,12]
[null,{"$f":"Text!C27","v":"Puissance thermique requise chaleur ambiante  max. [kW]"},870,470,null,10]
[null,{"$f":"Text!C28","v":"Facteur de correction besoin de chaleur [-]"},1,0.85,null,0.7]
[null,{"$f":"Text!C29","v":"Facteur de correction pointe de préchauffage [-]"},1,1,null,1]
[{"$f":"Text!C30","v":"Eau chaude"},{"$f":"Text!C31","v":"Besoin de chaleur annuel eau chaude [MWh/a]*"},560,70,null,11]
[null,{"$f":"Text!C32","v":"Puissance thermique requise eau chaude max. [kW]"},130,130,null,2.5]
[{"$f":"Text!C33","v":"Chaleur industrielle"},{"$f":"Text!C34","v":"Besoins de chaleur annuel chaleur industrielle [MWh/a]*"},null,null,500]
[null,{"$f":"Text!C35","v":"Puissance thermique requise chaleur industrielle max. [kW]"},null,null,110]
[]
[]
[{"$f":"Text!C38","v":"Données caractéristiques calculées"}]
[]
[{"$f":"Text!C90","v":"Besoin de chaleur globale [MWh/a]"},null,{"$f":"C23+C27+C29","v":2560},{"$f":"D23+D27+D29","v":850},500,23,0,0,0,0,0,0,0,0,0,0,0,0,0,0,0,0,0,0,0,0,0,0,0,0,0,0,0,0,0,0,0,0,0,0,0,0,0,0,0,0,0,0,0,0,0,0,0,0,0,0,0,0,0,0,0,0,0,0,0,0,0,{"$f":"BP23+BP27+BP29","v":0},0,0,0,0,0,0,0,0,0,0,0,0,0,0,0,0,0,0,0,0,0,0,0,0,0,0,0,0,0,0,0,0,0,0,0,0,0,0,0,0,0,0,0,0,0,0,0,0,0,0,0,0,0,0,0,0,0,0,0,0,0,0,0,{"$f":"EB23+EB27+EB29","v":0},0,0,0,0,0,0,0,0,0,0,0,0,0,0,0,0,0,0,0,0,0,0,0,0,0,0,0,0,0,0,0,0,0,0,0,0,0,0,0,0,0,0,0,0,0,0,0,0,0,0,0,0,0,0,0,0,0,0,0,0,0,0,0,{"$f":"GN23+GN27+GN29","v":0},0,0,0,0,0,0,0,0,0,0,0,0,0,0,0,0,0,0,0,0,0,0,0,0,0,0,0,0,0,0,0,0,0,0,0,0,0,0,0,0,0,0,0,0,0,0,0,0,0,0,0,0,0,0,0,0,0,0,0,0]
[{"$f":"Text!C39","v":"Chaleur ambiante"},{"$f":"Text!C40","v":"Heures de marche à pleine charge chaleur ambiante [h/a]"},{"$f":"IF(C24=\"\",\"\",ROUND(C23*1000/C24,2))","v":2298.85},1659.57,"",1200,"","","","","","","","","","","","","","","","","","","","","","","","","","","","","","","","","","","","","","","","","","","","","","","","","","","","","","","","","","","","",{"$f":"IF(BO24=\"\",\"\",ROUND(BO23*1000/BO24,2))","v":""},"","","","","","","","","","","","","","","","","","","","","","","","","","","","","","","","","","","","","","","","","","","","","","","","","","","","","","","","","","","","","","","",{"$f":"IF(EA24=\"\",\"\",ROUND(EA23*1000/EA24,2))","v":""},"","","","","","","","","","","","","","","","","","","","","","","","","","","","","","","","","","","","","","","","","","","","","","","","","","","","","","","","","","","","","","","",{"$f":"IF(GM24=\"\",\"\",ROUND(GM23*1000/GM24,2))","v":""},"","","","","","","","","","","","","","","","","","","","","","","","","","","","","","","","","","","","","","","","","","","","","","","","","","","","","","","","","","","","",""]
[null,{"$f":"Text!C41","v":"Besoin de chaleur spécifique [kWh/m²a]"},{"$f":"IF(C20=\"\",\"\",ROUND(C23*1000/C20,3))","v":100},{"$f":"IF(D20=\"\",\"\",ROUND(D23*1000/D20,3))","v":78},{"$f":"IF(E20=\"\",\"\",ROUND(E23*1000/E20,3))","v":""},30,"","","","","","","","","","","","","","","","","","","","","","","","","","","","","","","","","","","","","","","","","","","","","","","","","","","","","","","","","","","","","","",{"$f":"IF(BQ20=\"\",\"\",ROUND(BQ23*1000/BQ20,3))","v":""},"","","","","","","","","","","","","","","","","","","","","","","","","","","","","","","","","","","","","","","","","","","","","","","","","","","","","","","","","","","","","","","",{"$f":"IF(EC20=\"\",\"\",ROUND(EC23*1000/EC20,3))","v":""},"","","","","","","","","","","","","","","","","","","","","","","","","","","","","","","","","","","","","","","","","","","","","","","","","","","","","","","","","","","","","","","",{"$f":"IF(GO20=\"\",\"\",ROUND(GO23*1000/GO20,3))","v":""},"","","","","","","","","","","","","","","","","","","","","","","","","","","","","","","","","","","","","","","","","","","","","","","","","","","","","","","","","","",""]
[null,{"$f":"Text!C42","v":"Puissance thermique spécifique requise [W/m²]"},{"$f":"IF(C20=\"\",\"\",ROUND(C24*1000/C20,3))","v":43.5},{"$f":"IF(D20=\"\",\"\",ROUND(D24*1000/D20,3))","v":47},{"$f":"IF(E20=\"\",\"\",ROUND(E24*1000/E20,3))","v":""},25,"","","","","","","","","","","","","","","","","","","","","","","","","","","","","","","","","","","","","","","","","","","","","","","","","","","","","","","","","","","","","","",{"$f":"IF(BQ20=\"\",\"\",ROUND(BQ24*1000/BQ20,3))","v":""},"","","","","","","","","","","","","","","","","","","","","","","","","","","","","","","","","","","","","","","","","","","","","","","","","","","","","","","","","","","","","","","",{"$f":"IF(EC20=\"\",\"\",ROUND(EC24*1000/EC20,3))","v":""},"","","","","","","","","","","","","","","","","","","","","","","","","","","","","","","","","","","","","","","","","","","","","","","","","","","","","","","","","","","","","","","",{"$f":"IF(GO20=\"\",\"\",ROUND(GO24*1000/GO20,3))","v":""},"","","","","","","","","","","","","","","","","","","","","","","","","","","","","","","","","","","","","","","","","","","","","","","","","","","","","","","","","","",""]
[{"$f":"Text!C43","v":"Eau chaude"},{"$f":"Text!C44","v":"Heures de marche à pleine charge eau chaude [h/a]"},{"$f":"IF(C28=\"\",\"\",ROUND(C27*1000/C28,2))","v":4307.6899999999996},{"$f":"IF(D28=\"\",\"\",ROUND(D27*1000/D28,2))","v":538.46},"",4400,"","","","","","","","","","","","","","","","","","","","","","","","","","","","","","","","","","","","","","","","","","","","","","","","","","","","","","","","","","","","","",{"$f":"IF(BP28=\"\",\"\",ROUND(BP27*1000/BP28,2))","v":""},"","","","","","","","","","","","","","","","","","","","","","","","","","","","","","","","","","","","","","","","","","","","","","","","","","","","","","","","","","","","","","","",{"$f":"IF(EB28=\"\",\"\",ROUND(EB27*1000/EB28,2))","v":""},"","","","","","","","","","","","","","","","","","","","","","","","","","","","","","","","","","","","","","","","","","","","","","","","","","","","","","","","","","","","","","","",{"$f":"IF(GN28=\"\",\"\",ROUND(GN27*1000/GN28,2))","v":""},"","","","","","","","","","","","","","","","","","","","","","","","","","","","","","","","","","","","","","","","","","","","","","","","","","","","","","","","","","","",""]
[null,{"$f":"Text!C45","v":"Besoin d'énergie spécifique eau chaude [kWh/m²a]"},{"$f":"IF(C20=\"\",\"\",ROUND(C27*1000/C20,3))","v":28},{"$f":"IF(D20=\"\",\"\",ROUND(D27*1000/D20,3))","v":7},"",27.5,"","","","","","","","","","","","","","","","","","","","","","","","","","","","","","","","","","","","","","","","","","","","","","","","","","","","","","","","","","","","","",{"$f":"IF(BP20=\"\",\"\",ROUND(BP27*1000/BP20,3))","v":""},"","","","","","","","","","","","","","","","","","","","","","","","","","","","","","","","","","","","","","","","","","","","","","","","","","","","","","","","","","","","","","","",{"$f":"IF(EB20=\"\",\"\",ROUND(EB27*1000/EB20,3))","v":""},"","","","","","","","","","","","","","","","","","","","","","","","","","","","","","","","","","","","","","","","","","","","","","","","","","","","","","","","","","","","","","","",{"$f":"IF(GN20=\"\",\"\",ROUND(GN27*1000/GN20,3))","v":""},"","","","","","","","","","","","","","","","","","","","","","","","","","","","","","","","","","","","","","","","","","","","","","","","","","","","","","","","","","","",""]
[{"$f":"Text!C46","v":"Chaleur industrielle"},{"$f":"Text!C47","v":"Heures de marche à pleine charge chaleur industrielle [h/a]"},{"$f":"IF(C30=\"\",\"\",ROUND(C29*1000/C30,2))","v":""},{"$f":"IF(D30=\"\",\"\",ROUND(D29*1000/D30,2))","v":""},4545.45,"","","","","","","","","","","","","","","","","","","","","","","","","","","","","","","","","","","","","","","","","","","","","","","","","","","","","","","","","","","","","","",{"$f":"IF(BP30=\"\",\"\",ROUND(BP29*1000/BP30,2))","v":""},"","","","","","","","","","","","","","","","","","","","","","","","","","","","","","","","","","","","","","","","","","","","","","","","","","","","","","","","","","","","","","","",{"$f":"IF(EB30=\"\",\"\",ROUND(EB29*1000/EB30,2))","v":""},"","","","","","","","","","","","","","","","","","","","","","","","","","","","","","","","","","","","","","","","","","","","","","","","","","","","","","","","","","","","","","","",{"$f":"IF(GN30=\"\",\"\",ROUND(GN29*1000/GN30,2))","v":""},"","","","","","","","","","","","","","","","","","","","","","","","","","","","","","","","","","","","","","","","","","","","","","","","","","","","","","","","","","","",""]
[]
[{"$f":"Text!C49","v":"* Le besoin de chaleur annuel pour 365 jours doit être indiqué"}]
[{"$f":"Text!C50","v":"(besoin de chaleur hiver = besoin de chaleur annuel x jours chauffées / 365 jours)"}]
[null,{"$f":"B46","v":"Relevé de situation V37"}]
[{"$f":"Text!C52","v":"Champs a remplir"},{"$f":"Text!C36","v":"Relevé de situation V37"}]
[null,{"$f":"Text!C37","v":"Format de fichier: .xlsm"}]
[]
[{"$f":"Text!C19","v":"Langue"}]
[]
[]
["Hilfswerte",null,{"$f":"IF(C22=\"\",\"\",ROUND((C24+C28+C30)/('Allgemeine Angaben'!$C$15-Verbraucher!C22),3))","v":28.571000000000002},{"$f":"IF(D22=\"\",\"\",ROUND((D24+D28+D30)/('Allgemeine Angaben'!$C$15-Verbraucher!D22),3))","v":20},{"$f":"IF(E22=\"\",\"\",ROUND((E24+E28+E30)/('Allgemeine Angaben'!$C$15-Verbraucher!E22),3))","v":4.4000000000000004},{"$f":"IF(F22=\"\",\"\",ROUND((F24+F28+F30)/('Allgemeine Angaben'!$C$15-Verbraucher!F22),3))","v":0.22700000000000001},{"$f":"IF(G22=\"\",\"\",ROUND((G24+G28+G30)/('Allgemeine Angaben'!$C$15-Verbraucher!G22),3))","v":""},{"$f":"IF(H22=\"\",\"\",ROUND((H24+H28+H30)/('Allgemeine Angaben'!$C$15-Verbraucher!H22),3))","v":""},{"$f":"IF(I22=\"\",\"\",ROUND((I24+I28+I30)/('Allgemeine Angaben'!$C$15-Verbraucher!I22),3))","v":""},{"$f":"IF(J22=\"\",\"\",ROUND((J24+J28+J30)/('Allgemeine Angaben'!$C$15-Verbraucher!J22),3))","v":""},{"$f":"IF(K22=\"\",\"\",ROUND((K24+K28+K30)/('Allgemeine Angaben'!$C$15-Verbraucher!K22),3))","v":""},{"$f":"IF(L22=\"\",\"\",ROUND((L24+L28+L30)/('Allgemeine Angaben'!$C$15-Verbraucher!L22),3))","v":""},{"$f":"IF(M22=\"\",\"\",ROUND((M24+M28+M30)/('Allgemeine Angaben'!$C$15-Verbraucher!M22),3))","v":""},{"$f":"IF(N22=\"\",\"\",ROUND((N24+N28+N30)/('Allgemeine Angaben'!$C$15-Verbraucher!N22),3))","v":""},{"$f":"IF(O22=\"\",\"\",ROUND((O24+O28+O30)/('Allgemeine Angaben'!$C$15-Verbraucher!O22),3))","v":""},{"$f":"IF(P22=\"\",\"\",ROUND((P24+P28+P30)/('Allgemeine Angaben'!$C$15-Verbraucher!P22),3))","v":""},{"$f":"IF(Q22=\"\",\"\",ROUND((Q24+Q28+Q30)/('Allgemeine Angaben'!$C$15-Verbraucher!Q22),3))","v":""},{"$f":"IF(R22=\"\",\"\",ROUND((R24+R28+R30)/('Allgemeine Angaben'!$C$15-Verbraucher!R22),3))","v":""},{"$f":"IF(S22=\"\",\"\",ROUND((S24+S28+S30)/('Allgemeine Angaben'!$C$15-Verbraucher!S22),3))","v":""},{"$f":"IF(T22=\"\",\"\",ROUND((T24+T28+T30)/('Allgemeine Angaben'!$C$15-Verbraucher!T22),3))","v":""},{"$f":"IF(U22=\"\",\"\",ROUND((U24+U28+U30)/('Allgemeine Angaben'!$C$15-Verbraucher!U22),3))","v":""},{"$f":"IF(V22=\"\",\"\",ROUND((V24+V28+V30)/('Allgemeine Angaben'!$C$15-Verbraucher!V22),3))","v":""},{"$f":"IF(W22=\"\",\"\",ROUND((W24+W28+W30)/('Allgemeine Angaben'!$C$15-Verbraucher!W22),3))","v":""},{"$f":"IF(X22=\"\",\"\",ROUND((X24+X28+X30)/('Allgemeine Angaben'!$C$15-Verbraucher!X22),3))","v":""},{"$f":"IF(Y22=\"\",\"\",ROUND((Y24+Y28+Y30)/('Allgemeine Angaben'!$C$15-Verbraucher!Y22),3))","v":""},{"$f":"IF(Z22=\"\",\"\",ROUND((Z24+Z28+Z30)/('Allgemeine Angaben'!$C$15-Verbraucher!Z22),3))","v":""},{"$f":"IF(AA22=\"\",\"\",ROUND((AA24+AA28+AA30)/('Allgemeine Angaben'!$C$15-Verbraucher!AA22),3))","v":""},{"$f":"IF(AB22=\"\",\"\",ROUND((AB24+AB28+AB30)/('Allgemeine Angaben'!$C$15-Verbraucher!AB22),3))","v":""},{"$f":"IF(AC22=\"\",\"\",ROUND((AC24+AC28+AC30)/('Allgemeine Angaben'!$C$15-Verbraucher!AC22),3))","v":""},{"$f":"IF(AD22=\"\",\"\",ROUND((AD24+AD28+AD30)/('Allgemeine Angaben'!$C$15-Verbraucher!AD22),3))","v":""},{"$f":"IF(AE22=\"\",\"\",ROUND((AE24+AE28+AE30)/('Allgemeine Angaben'!$C$15-Verbraucher!AE22),3))","v":""},{"$f":"IF(AF22=\"\",\"\",ROUND((AF24+AF28+AF30)/('Allgemeine Angaben'!$C$15-Verbraucher!AF22),3))","v":""},{"$f":"IF(AG22=\"\",\"\",ROUND((AG24+AG28+AG30)/('Allgemeine Angaben'!$C$15-Verbraucher!AG22),3))","v":""},{"$f":"IF(AH22=\"\",\"\",ROUND((AH24+AH28+AH30)/('Allgemeine Angaben'!$C$15-Verbraucher!AH22),3))","v":""},{"$f":"IF(AI22=\"\",\"\",ROUND((AI24+AI28+AI30)/('Allgemeine Angaben'!$C$15-Verbraucher!AI22),3))","v":""},{"$f":"IF(AJ22=\"\",\"\",ROUND((AJ24+AJ28+AJ30)/('Allgemeine Angaben'!$C$15-Verbraucher!AJ22),3))","v":""},{"$f":"IF(AK22=\"\",\"\",ROUND((AK24+AK28+AK30)/('Allgemeine Angaben'!$C$15-Verbraucher!AK22),3))","v":""},{"$f":"IF(AL22=\"\",\"\",ROUND((AL24+AL28+AL30)/('Allgemeine Angaben'!$C$15-Verbraucher!AL22),3))","v":""},{"$f":"IF(AM22=\"\",\"\",ROUND((AM24+AM28+AM30)/('Allgemeine Angaben'!$C$15-Verbraucher!AM22),3))","v":""},{"$f":"IF(AN22=\"\",\"\",ROUND((AN24+AN28+AN30)/('Allgemeine Angaben'!$C$15-Verbraucher!AN22),3))","v":""},{"$f":"IF(AO22=\"\",\"\",ROUND((AO24+AO28+AO30)/('Allgemeine Angaben'!$C$15-Verbraucher!AO22),3))","v":""},{"$f":"IF(AP22=\"\",\"\",ROUND((AP24+AP28+AP30)/('Allgemeine Angaben'!$C$15-Verbraucher!AP22),3))","v":""},{"$f":"IF(AQ22=\"\",\"\",ROUND((AQ24+AQ28+AQ30)/('Allgemeine Angaben'!$C$15-Verbraucher!AQ22),3))","v":""},{"$f":"IF(AR22=\"\",\"\",ROUND((AR24+AR28+AR30)/('Allgemeine Angaben'!$C$15-Verbraucher!AR22),3))","v":""},{"$f":"IF(AS22=\"\",\"\",ROUND((AS24+AS28+AS30)/('Allgemeine Angaben'!$C$15-Verbraucher!AS22),3))","v":""},{"$f":"IF(AT22=\"\",\"\",ROUND((AT24+AT28+AT30)/('Allgemeine Angaben'!$C$15-Verbraucher!AT22),3))","v":""},{"$f":"IF(AU22=\"\",\"\",ROUND((AU24+AU28+AU30)/('Allgemeine Angaben'!$C$15-Verbraucher!AU22),3))","v":""},{"$f":"IF(AV22=\"\",\"\",ROUND((AV24+AV28+AV30)/('Allgemeine Angaben'!$C$15-Verbraucher!AV22),3))","v":""},{"$f":"IF(AW22=\"\",\"\",ROUND((AW24+AW28+AW30)/('Allgemeine Angaben'!$C$15-Verbraucher!AW22),3))","v":""},{"$f":"IF(AX22=\"\",\"\",ROUND((AX24+AX28+AX30)/('Allgemeine Angaben'!$C$15-Verbraucher!AX22),3))","v":""},{"$f":"IF(AY22=\"\",\"\",ROUND((AY24+AY28+AY30)/('Allgemeine Angaben'!$C$15-Verbraucher!AY22),3))","v":""},{"$f":"IF(AZ22=\"\",\"\",ROUND((AZ24+AZ28+AZ30)/('Allgemeine Angaben'!$C$15-Verbraucher!AZ22),3))","v":""},{"$f":"IF(BA22=\"\",\"\",ROUND((BA24+BA28+BA30)/('Allgemeine Angaben'!$C$15-Verbraucher!BA22),3))","v":""},{"$f":"IF(BB22=\"\",\"\",ROUND((BB24+BB28+BB30)/('Allgemeine Angaben'!$C$15-Verbraucher!BB22),3))","v":""},{"$f":"IF(BC22=\"\",\"\",ROUND((BC24+BC28+BC30)/('Allgemeine Angaben'!$C$15-Verbraucher!BC22),3))","v":""},{"$f":"IF(BD22=\"\",\"\",ROUND((BD24+BD28+BD30)/('Allgemeine Angaben'!$C$15-Verbraucher!BD22),3))","v":""},{"$f":"IF(BE22=\"\",\"\",ROUND((BE24+BE28+BE30)/('Allgemeine Angaben'!$C$15-Verbraucher!BE22),3))","v":""},{"$f":"IF(BF22=\"\",\"\",ROUND((BF24+BF28+BF30)/('Allgemeine Angaben'!$C$15-Verbraucher!BF22),3))","v":""},{"$f":"IF(BG22=\"\",\"\",ROUND((BG24+BG28+BG30)/('Allgemeine Angaben'!$C$15-Verbraucher!BG22),3))","v":""},{"$f":"IF(BH22=\"\",\"\",ROUND((BH24+BH28+BH30)/('Allgemeine Angaben'!$C$15-Verbraucher!BH22),3))","v":""},{"$f":"IF(BI22=\"\",\"\",ROUND((BI24+BI28+BI30)/('Allgemeine Angaben'!$C$15-Verbraucher!BI22),3))","v":""},{"$f":"IF(BJ22=\"\",\"\",ROUND((BJ24+BJ28+BJ30)/('Allgemeine Angaben'!$C$15-Verbraucher!BJ22),3))","v":""},{"$f":"IF(BK22=\"\",\"\",ROUND((BK24+BK28+BK30)/('Allgemeine Angaben'!$C$15-Verbraucher!BK22),3))","v":""},{"$f":"IF(BL22=\"\",\"\",ROUND((BL24+BL28+BL30)/('Allgemeine Angaben'!$C$15-Verbraucher!BL22),3))","v":""},{"$f":"IF(BM22=\"\",\"\",ROUND((BM24+BM28+BM30)/('Allgemeine Angaben'!$C$15-Verbraucher!BM22),3))","v":""},{"$f":"IF(BN22=\"\",\"\",ROUND((BN24+BN28+BN30)/('Allgemeine Angaben'!$C$15-Verbraucher!BN22),3))","v":""},{"$f":"IF(BO22=\"\",\"\",ROUND((BO24+BO28+BO30)/('Allgemeine Angaben'!$C$15-Verbraucher!BO22),3))","v":""},{"$f":"IF(BP22=\"\",\"\",ROUND((BP24+BP28+BP30)/('Allgemeine Angaben'!$C$15-Verbraucher!BP22),3))","v":""},{"$f":"IF(BQ22=\"\",\"\",ROUND((BQ24+BQ28+BQ30)/('Allgemeine Angaben'!$C$15-Verbraucher!BQ22),3))","v":""},{"$f":"IF(BR22=\"\",\"\",ROUND((BR24+BR28+BR30)/('Allgemeine Angaben'!$C$15-Verbraucher!BR22),3))","v":""},{"$f":"IF(BS22=\"\",\"\",ROUND((BS24+BS28+BS30)/('Allgemeine Angaben'!$C$15-Verbraucher!BS22),3))","v":""},{"$f":"IF(BT22=\"\",\"\",ROUND((BT24+BT28+BT30)/('Allgemeine Angaben'!$C$15-Verbraucher!BT22),3))","v":""},{"$f":"IF(BU22=\"\",\"\",ROUND((BU24+BU28+BU30)/('Allgemeine Angaben'!$C$15-Verbraucher!BU22),3))","v":""},{"$f":"IF(BV22=\"\",\"\",ROUND((BV24+BV28+BV30)/('Allgemeine Angaben'!$C$15-Verbraucher!BV22),3))","v":""},{"$f":"IF(BW22=\"\",\"\",ROUND((BW24+BW28+BW30)/('Allgemeine Angaben'!$C$15-Verbraucher!BW22),3))","v":""},{"$f":"IF(BX22=\"\",\"\",ROUND((BX24+BX28+BX30)/('Allgemeine Angaben'!$C$15-Verbraucher!BX22),3))","v":""},{"$f":"IF(BY22=\"\",\"\",ROUND((BY24+BY28+BY30)/('Allgemeine Angaben'!$C$15-Verbraucher!BY22),3))","v":""},{"$f":"IF(BZ22=\"\",\"\",ROUND((BZ24+BZ28+BZ30)/('Allgemeine Angaben'!$C$15-Verbraucher!BZ22),3))","v":""},{"$f":"IF(CA22=\"\",\"\",ROUND((CA24+CA28+CA30)/('Allgemeine Angaben'!$C$15-Verbraucher!CA22),3))","v":""},{"$f":"IF(CB22=\"\",\"\",ROUND((CB24+CB28+CB30)/('Allgemeine Angaben'!$C$15-Verbraucher!CB22),3))","v":""},{"$f":"IF(CC22=\"\",\"\",ROUND((CC24+CC28+CC30)/('Allgemeine Angaben'!$C$15-Verbraucher!CC22),3))","v":""},{"$f":"IF(CD22=\"\",\"\",ROUND((CD24+CD28+CD30)/('Allgemeine Angaben'!$C$15-Verbraucher!CD22),3))","v":""},{"$f":"IF(CE22=\"\",\"\",ROUND((CE24+CE28+CE30)/('Allgemeine Angaben'!$C$15-Verbraucher!CE22),3))","v":""},{"$f":"IF(CF22=\"\",\"\",ROUND((CF24+CF28+CF30)/('Allgemeine Angaben'!$C$15-Verbraucher!CF22),3))","v":""},{"$f":"IF(CG22=\"\",\"\",ROUND((CG24+CG28+CG30)/('Allgemeine Angaben'!$C$15-Verbraucher!CG22),3))","v":""},{"$f":"IF(CH22=\"\",\"\",ROUND((CH24+CH28+CH30)/('Allgemeine Angaben'!$C$15-Verbraucher!CH22),3))","v":""},{"$f":"IF(CI22=\"\",\"\",ROUND((CI24+CI28+CI30)/('Allgemeine Angaben'!$C$15-Verbraucher!CI22),3))","v":""},{"$f":"IF(CJ22=\"\",\"\",ROUND((CJ24+CJ28+CJ30)/('Allgemeine Angaben'!$C$15-Verbraucher!CJ22),3))","v":""},{"$f":"IF(CK22=\"\",\"\",ROUND((CK24+CK28+CK30)/('Allgemeine Angaben'!$C$15-Verbraucher!CK22),3))","v":""},{"$f":"IF(CL22=\"\",\"\",ROUND((CL24+CL28+CL30)/('Allgemeine Angaben'!$C$15-Verbraucher!CL22),3))","v":""},{"$f":"IF(CM22=\"\",\"\",ROUND((CM24+CM28+CM30)/('Allgemeine Angaben'!$C$15-Verbraucher!CM22),3))","v":""},{"$f":"IF(CN22=\"\",\"\",ROUND((CN24+CN28+CN30)/('Allgemeine Angaben'!$C$15-Verbraucher!CN22),3))","v":""},{"$f":"IF(CO22=\"\",\"\",ROUND((CO24+CO28+CO30)/('Allgemeine Angaben'!$C$15-Verbraucher!CO22),3))","v":""},{"$f":"IF(CP22=\"\",\"\",ROUND((CP24+CP28+CP30)/('Allgemeine Angaben'!$C$15-Verbraucher!CP22),3))","v":""},{"$f":"IF(CQ22=\"\",\"\",ROUND((CQ24+CQ28+CQ30)/('Allgemeine Angaben'!$C$15-Verbraucher!CQ22),3))","v":""},{"$f":"IF(CR22=\"\",\"\",ROUND((CR24+CR28+CR30)/('Allgemeine Angaben'!$C$15-Verbraucher!CR22),3))","v":""},{"$f":"IF(CS22=\"\",\"\",ROUND((CS24+CS28+CS30)/('Allgemeine Angaben'!$C$15-Verbraucher!CS22),3))","v":""},{"$f":"IF(CT22=\"\",\"\",ROUND((CT24+CT28+CT30)/('Allgemeine Angaben'!$C$15-Verbraucher!CT22),3))","v":""},{"$f":"IF(CU22=\"\",\"\",ROUND((CU24+CU28+CU30)/('Allgemeine Angaben'!$C$15-Verbraucher!CU22),3))","v":""},{"$f":"IF(CV22=\"\",\"\",ROUND((CV24+CV28+CV30)/('Allgemeine Angaben'!$C$15-Verbraucher!CV22),3))","v":""},{"$f":"IF(CW22=\"\",\"\",ROUND((CW24+CW28+CW30)/('Allgemeine Angaben'!$C$15-Verbraucher!CW22),3))","v":""},{"$f":"IF(CX22=\"\",\"\",ROUND((CX24+CX28+CX30)/('Allgemeine Angaben'!$C$15-Verbraucher!CX22),3))","v":""},{"$f":"IF(CY22=\"\",\"\",ROUND((CY24+CY28+CY30)/('Allgemeine Angaben'!$C$15-Verbraucher!CY22),3))","v":""},{"$f":"IF(CZ22=\"\",\"\",ROUND((CZ24+CZ28+CZ30)/('Allgemeine Angaben'!$C$15-Verbraucher!CZ22),3))","v":""},{"$f":"IF(DA22=\"\",\"\",ROUND((DA24+DA28+DA30)/('Allgemeine Angaben'!$C$15-Verbraucher!DA22),3))","v":""},{"$f":"IF(DB22=\"\",\"\",ROUND((DB24+DB28+DB30)/('Allgemeine Angaben'!$C$15-Verbraucher!DB22),3))","v":""},{"$f":"IF(DC22=\"\",\"\",ROUND((DC24+DC28+DC30)/('Allgemeine Angaben'!$C$15-Verbraucher!DC22),3))","v":""},{"$f":"IF(DD22=\"\",\"\",ROUND((DD24+DD28+DD30)/('Allgemeine Angaben'!$C$15-Verbraucher!DD22),3))","v":""},{"$f":"IF(DE22=\"\",\"\",ROUND((DE24+DE28+DE30)/('Allgemeine Angaben'!$C$15-Verbraucher!DE22),3))","v":""},{"$f":"IF(DF22=\"\",\"\",ROUND((DF24+DF28+DF30)/('Allgemeine Angaben'!$C$15-Verbraucher!DF22),3))","v":""},{"$f":"IF(DG22=\"\",\"\",ROUND((DG24+DG28+DG30)/('Allgemeine Angaben'!$C$15-Verbraucher!DG22),3))","v":""},{"$f":"IF(DH22=\"\",\"\",ROUND((DH24+DH28+DH30)/('Allgemeine Angaben'!$C$15-Verbraucher!DH22),3))","v":""},{"$f":"IF(DI22=\"\",\"\",ROUND((DI24+DI28+DI30)/('Allgemeine Angaben'!$C$15-Verbraucher!DI22),3))","v":""},{"$f":"IF(DJ22=\"\",\"\",ROUND((DJ24+DJ28+DJ30)/('Allgemeine Angaben'!$C$15-Verbraucher!DJ22),3))","v":""},{"$f":"IF(DK22=\"\",\"\",ROUND((DK24+DK28+DK30)/('Allgemeine Angaben'!$C$15-Verbraucher!DK22),3))","v":""},{"$f":"IF(DL22=\"\",\"\",ROUND((DL24+DL28+DL30)/('Allgemeine Angaben'!$C$15-Verbraucher!DL22),3))","v":""},{"$f":"IF(DM22=\"\",\"\",ROUND((DM24+DM28+DM30)/('Allgemeine Angaben'!$C$15-Verbraucher!DM22),3))","v":""},{"$f":"IF(DN22=\"\",\"\",ROUND((DN24+DN28+DN30)/('Allgemeine Angaben'!$C$15-Verbraucher!DN22),3))","v":""},{"$f":"IF(DO22=\"\",\"\",ROUND((DO24+DO28+DO30)/('Allgemeine Angaben'!$C$15-Verbraucher!DO22),3))","v":""},{"$f":"IF(DP22=\"\",\"\",ROUND((DP24+DP28+DP30)/('Allgemeine Angaben'!$C$15-Verbraucher!DP22),3))","v":""},{"$f":"IF(DQ22=\"\",\"\",ROUND((DQ24+DQ28+DQ30)/('Allgemeine Angaben'!$C$15-Verbraucher!DQ22),3))","v":""},{"$f":"IF(DR22=\"\",\"\",ROUND((DR24+DR28+DR30)/('Allgemeine Angaben'!$C$15-Verbraucher!DR22),3))","v":""},{"$f":"IF(DS22=\"\",\"\",ROUND((DS24+DS28+DS30)/('Allgemeine Angaben'!$C$15-Verbraucher!DS22),3))","v":""},{"$f":"IF(DT22=\"\",\"\",ROUND((DT24+DT28+DT30)/('Allgemeine Angaben'!$C$15-Verbraucher!DT22),3))","v":""},{"$f":"IF(DU22=\"\",\"\",ROUND((DU24+DU28+DU30)/('Allgemeine Angaben'!$C$15-Verbraucher!DU22),3))","v":""},{"$f":"IF(DV22=\"\",\"\",ROUND((DV24+DV28+DV30)/('Allgemeine Angaben'!$C$15-Verbraucher!DV22),3))","v":""},{"$f":"IF(DW22=\"\",\"\",ROUND((DW24+DW28+DW30)/('Allgemeine Angaben'!$C$15-Verbraucher!DW22),3))","v":""},{"$f":"IF(DX22=\"\",\"\",ROUND((DX24+DX28+DX30)/('Allgemeine Angaben'!$C$15-Verbraucher!DX22),3))","v":""},{"$f":"IF(DY22=\"\",\"\",ROUND((DY24+DY28+DY30)/('Allgemeine Angaben'!$C$15-Verbraucher!DY22),3))","v":""},{"$f":"IF(DZ22=\"\",\"\",ROUND((DZ24+DZ28+DZ30)/('Allgemeine Angaben'!$C$15-Verbraucher!DZ22),3))","v":""},{"$f":"IF(EA22=\"\",\"\",ROUND((EA24+EA28+EA30)/('Allgemeine Angaben'!$C$15-Verbraucher!EA22),3))","v":""},{"$f":"IF(EB22=\"\",\"\",ROUND((EB24+EB28+EB30)/('Allgemeine Angaben'!$C$15-Verbraucher!EB22),3))","v":""},{"$f":"IF(EC22=\"\",\"\",ROUND((EC24+EC28+EC30)/('Allgemeine Angaben'!$C$15-Verbraucher!EC22),3))","v":""},{"$f":"IF(ED22=\"\",\"\",ROUND((ED24+ED28+ED30)/('Allgemeine Angaben'!$C$15-Verbraucher!ED22),3))","v":""},{"$f":"IF(EE22=\"\",\"\",ROUND((EE24+EE28+EE30)/('Allgemeine Angaben'!$C$15-Verbraucher!EE22),3))","v":""},{"$f":"IF(EF22=\"\",\"\",ROUND((EF24+EF28+EF30)/('Allgemeine Angaben'!$C$15-Verbraucher!EF22),3))","v":""},{"$f":"IF(EG22=\"\",\"\",ROUND((EG24+EG28+EG30)/('Allgemeine Angaben'!$C$15-Verbraucher!EG22),3))","v":""},{"$f":"IF(EH22=\"\",\"\",ROUND((EH24+EH28+EH30)/('Allgemeine Angaben'!$C$15-Verbraucher!EH22),3))","v":""},{"$f":"IF(EI22=\"\",\"\",ROUND((EI24+EI28+EI30)/('Allgemeine Angaben'!$C$15-Verbraucher!EI22),3))","v":""},{"$f":"IF(EJ22=\"\",\"\",ROUND((EJ24+EJ28+EJ30)/('Allgemeine Angaben'!$C$15-Verbraucher!EJ22),3))","v":""},{"$f":"IF(EK22=\"\",\"\",ROUND((EK24+EK28+EK30)/('Allgemeine Angaben'!$C$15-Verbraucher!EK22),3))","v":""},{"$f":"IF(EL22=\"\",\"\",ROUND((EL24+EL28+EL30)/('Allgemeine Angaben'!$C$15-Verbraucher!EL22),3))","v":""},{"$f":"IF(EM22=\"\",\"\",ROUND((EM24+EM28+EM30)/('Allgemeine Angaben'!$C$15-Verbraucher!EM22),3))","v":""},{"$f":"IF(EN22=\"\",\"\",ROUND((EN24+EN28+EN30)/('Allgemeine Angaben'!$C$15-Verbraucher!EN22),3))","v":""},{"$f":"IF(EO22=\"\",\"\",ROUND((EO24+EO28+EO30)/('Allgemeine Angaben'!$C$15-Verbraucher!EO22),3))","v":""},{"$f":"IF(EP22=\"\",\"\",ROUND((EP24+EP28+EP30)/('Allgemeine Angaben'!$C$15-Verbraucher!EP22),3))","v":""},{"$f":"IF(EQ22=\"\",\"\",ROUND((EQ24+EQ28+EQ30)/('Allgemeine Angaben'!$C$15-Verbraucher!EQ22),3))","v":""},{"$f":"IF(ER22=\"\",\"\",ROUND((ER24+ER28+ER30)/('Allgemeine Angaben'!$C$15-Verbraucher!ER22),3))","v":""},{"$f":"IF(ES22=\"\",\"\",ROUND((ES24+ES28+ES30)/('Allgemeine Angaben'!$C$15-Verbraucher!ES22),3))","v":""},{"$f":"IF(ET22=\"\",\"\",ROUND((ET24+ET28+ET30)/('Allgemeine Angaben'!$C$15-Verbraucher!ET22),3))","v":""},{"$f":"IF(EU22=\"\",\"\",ROUND((EU24+EU28+EU30)/('Allgemeine Angaben'!$C$15-Verbraucher!EU22),3))","v":""},{"$f":"IF(EV22=\"\",\"\",ROUND((EV24+EV28+EV30)/('Allgemeine Angaben'!$C$15-Verbraucher!EV22),3))","v":""},{"$f":"IF(EW22=\"\",\"\",ROUND((EW24+EW28+EW30)/('Allgemeine Angaben'!$C$15-Verbraucher!EW22),3))","v":""},{"$f":"IF(EX22=\"\",\"\",ROUND((EX24+EX28+EX30)/('Allgemeine Angaben'!$C$15-Verbraucher!EX22),3))","v":""},{"$f":"IF(EY22=\"\",\"\",ROUND((EY24+EY28+EY30)/('Allgemeine Angaben'!$C$15-Verbraucher!EY22),3))","v":""},{"$f":"IF(EZ22=\"\",\"\",ROUND((EZ24+EZ28+EZ30)/('Allgemeine Angaben'!$C$15-Verbraucher!EZ22),3))","v":""},{"$f":"IF(FA22=\"\",\"\",ROUND((FA24+FA28+FA30)/('Allgemeine Angaben'!$C$15-Verbraucher!FA22),3))","v":""},{"$f":"IF(FB22=\"\",\"\",ROUND((FB24+FB28+FB30)/('Allgemeine Angaben'!$C$15-Verbraucher!FB22),3))","v":""},{"$f":"IF(FC22=\"\",\"\",ROUND((FC24+FC28+FC30)/('Allgemeine Angaben'!$C$15-Verbraucher!FC22),3))","v":""},{"$f":"IF(FD22=\"\",\"\",ROUND((FD24+FD28+FD30)/('Allgemeine Angaben'!$C$15-Verbraucher!FD22),3))","v":""},{"$f":"IF(FE22=\"\",\"\",ROUND((FE24+FE28+FE30)/('Allgemeine Angaben'!$C$15-Verbraucher!FE22),3))","v":""},{"$f":"IF(FF22=\"\",\"\",ROUND((FF24+FF28+FF30)/('Allgemeine Angaben'!$C$15-Verbraucher!FF22),3))","v":""},{"$f":"IF(FG22=\"\",\"\",ROUND((FG24+FG28+FG30)/('Allgemeine Angaben'!$C$15-Verbraucher!FG22),3))","v":""},{"$f":"IF(FH22=\"\",\"\",ROUND((FH24+FH28+FH30)/('Allgemeine Angaben'!$C$15-Verbraucher!FH22),3))","v":""},{"$f":"IF(FI22=\"\",\"\",ROUND((FI24+FI28+FI30)/('Allgemeine Angaben'!$C$15-Verbraucher!FI22),3))","v":""},{"$f":"IF(FJ22=\"\",\"\",ROUND((FJ24+FJ28+FJ30)/('Allgemeine Angaben'!$C$15-Verbraucher!FJ22),3))","v":""},{"$f":"IF(FK22=\"\",\"\",ROUND((FK24+FK28+FK30)/('Allgemeine Angaben'!$C$15-Verbraucher!FK22),3))","v":""},{"$f":"IF(FL22=\"\",\"\",ROUND((FL24+FL28+FL30)/('Allgemeine Angaben'!$C$15-Verbraucher!FL22),3))","v":""},{"$f":"IF(FM22=\"\",\"\",ROUND((FM24+FM28+FM30)/('Allgemeine Angaben'!$C$15-Verbraucher!FM22),3))","v":""},{"$f":"IF(FN22=\"\",\"\",ROUND((FN24+FN28+FN30)/('Allgemeine Angaben'!$C$15-Verbraucher!FN22),3))","v":""},{"$f":"IF(FO22=\"\",\"\",ROUND((FO24+FO28+FO30)/('Allgemeine Angaben'!$C$15-Verbraucher!FO22),3))","v":""},{"$f":"IF(FP22=\"\",\"\",ROUND((FP24+FP28+FP30)/('Allgemeine Angaben'!$C$15-Verbraucher!FP22),3))","v":""},{"$f":"IF(FQ22=\"\",\"\",ROUND((FQ24+FQ28+FQ30)/('Allgemeine Angaben'!$C$15-Verbraucher!FQ22),3))","v":""},{"$f":"IF(FR22=\"\",\"\",ROUND((FR24+FR28+FR30)/('Allgemeine Angaben'!$C$15-Verbraucher!FR22),3))","v":""},{"$f":"IF(FS22=\"\",\"\",ROUND((FS24+FS28+FS30)/('Allgemeine Angaben'!$C$15-Verbraucher!FS22),3))","v":""},{"$f":"IF(FT22=\"\",\"\",ROUND((FT24+FT28+FT30)/('Allgemeine Angaben'!$C$15-Verbraucher!FT22),3))","v":""},{"$f":"IF(FU22=\"\",\"\",ROUND((FU24+FU28+FU30)/('Allgemeine Angaben'!$C$15-Verbraucher!FU22),3))","v":""},{"$f":"IF(FV22=\"\",\"\",ROUND((FV24+FV28+FV30)/('Allgemeine Angaben'!$C$15-Verbraucher!FV22),3))","v":""},{"$f":"IF(FW22=\"\",\"\",ROUND((FW24+FW28+FW30)/('Allgemeine Angaben'!$C$15-Verbraucher!FW22),3))","v":""},{"$f":"IF(FX22=\"\",\"\",ROUND((FX24+FX28+FX30)/('Allgemeine Angaben'!$C$15-Verbraucher!FX22),3))","v":""},{"$f":"IF(FY22=\"\",\"\",ROUND((FY24+FY28+FY30)/('Allgemeine Angaben'!$C$15-Verbraucher!FY22),3))","v":""},{"$f":"IF(FZ22=\"\",\"\",ROUND((FZ24+FZ28+FZ30)/('Allgemeine Angaben'!$C$15-Verbraucher!FZ22),3))","v":""},{"$f":"IF(GA22=\"\",\"\",ROUND((GA24+GA28+GA30)/('Allgemeine Angaben'!$C$15-Verbraucher!GA22),3))","v":""},{"$f":"IF(GB22=\"\",\"\",ROUND((GB24+GB28+GB30)/('Allgemeine Angaben'!$C$15-Verbraucher!GB22),3))","v":""},{"$f":"IF(GC22=\"\",\"\",ROUND((GC24+GC28+GC30)/('Allgemeine Angaben'!$C$15-Verbraucher!GC22),3))","v":""},{"$f":"IF(GD22=\"\",\"\",ROUND((GD24+GD28+GD30)/('Allgemeine Angaben'!$C$15-Verbraucher!GD22),3))","v":""},{"$f":"IF(GE22=\"\",\"\",ROUND((GE24+GE28+GE30)/('Allgemeine Angaben'!$C$15-Verbraucher!GE22),3))","v":""},{"$f":"IF(GF22=\"\",\"\",ROUND((GF24+GF28+GF30)/('Allgemeine Angaben'!$C$15-Verbraucher!GF22),3))","v":""},{"$f":"IF(GG22=\"\",\"\",ROUND((GG24+GG28+GG30)/('Allgemeine Angaben'!$C$15-Verbraucher!GG22),3))","v":""},{"$f":"IF(GH22=\"\",\"\",ROUND((GH24+GH28+GH30)/('Allgemeine Angaben'!$C$15-Verbraucher!GH22),3))","v":""},{"$f":"IF(GI22=\"\",\"\",ROUND((GI24+GI28+GI30)/('Allgemeine Angaben'!$C$15-Verbraucher!GI22),3))","v":""},{"$f":"IF(GJ22=\"\",\"\",ROUND((GJ24+GJ28+GJ30)/('Allgemeine Angaben'!$C$15-Verbraucher!GJ22),3))","v":""},{"$f":"IF(GK22=\"\",\"\",ROUND((GK24+GK28+GK30)/('Allgemeine Angaben'!$C$15-Verbraucher!GK22),3))","v":""},{"$f":"IF(GL22=\"\",\"\",ROUND((GL24+GL28+GL30)/('Allgemeine Angaben'!$C$15-Verbraucher!GL22),3))","v":""},{"$f":"IF(GM22=\"\",\"\",ROUND((GM24+GM28+GM30)/('Allgemeine Angaben'!$C$15-Verbraucher!GM22),3))","v":""},{"$f":"IF(GN22=\"\",\"\",ROUND((GN24+GN28+GN30)/('Allgemeine Angaben'!$C$15-Verbraucher!GN22),3))","v":""},{"$f":"IF(GO22=\"\",\"\",ROUND((GO24+GO28+GO30)/('Allgemeine Angaben'!$C$15-Verbraucher!GO22),3))","v":""},{"$f":"IF(GP22=\"\",\"\",ROUND((GP24+GP28+GP30)/('Allgemeine Angaben'!$C$15-Verbraucher!GP22),3))","v":""},{"$f":"IF(GQ22=\"\",\"\",ROUND((GQ24+GQ28+GQ30)/('Allgemeine Angaben'!$C$15-Verbraucher!GQ22),3))","v":""},{"$f":"IF(GR22=\"\",\"\",ROUND((GR24+GR28+GR30)/('Allgemeine Angaben'!$C$15-Verbraucher!GR22),3))","v":""},{"$f":"IF(GS22=\"\",\"\",ROUND((GS24+GS28+GS30)/('Allgemeine Angaben'!$C$15-Verbraucher!GS22),3))","v":""},{"$f":"IF(GT22=\"\",\"\",ROUND((GT24+GT28+GT30)/('Allgemeine Angaben'!$C$15-Verbraucher!GT22),3))","v":""},{"$f":"IF(GU22=\"\",\"\",ROUND((GU24+GU28+GU30)/('Allgemeine Angaben'!$C$15-Verbraucher!GU22),3))","v":""},{"$f":"IF(GV22=\"\",\"\",ROUND((GV24+GV28+GV30)/('Allgemeine Angaben'!$C$15-Verbraucher!GV22),3))","v":""},{"$f":"IF(GW22=\"\",\"\",ROUND((GW24+GW28+GW30)/('Allgemeine Angaben'!$C$15-Verbraucher!GW22),3))","v":""},{"$f":"IF(GX22=\"\",\"\",ROUND((GX24+GX28+GX30)/('Allgemeine Angaben'!$C$15-Verbraucher!GX22),3))","v":""},{"$f":"IF(GY22=\"\",\"\",ROUND((GY24+GY28+GY30)/('Allgemeine Angaben'!$C$15-Verbraucher!GY22),3))","v":""},{"$f":"IF(GZ22=\"\",\"\",ROUND((GZ24+GZ28+GZ30)/('Allgemeine Angaben'!$C$15-Verbraucher!GZ22),3))","v":""},{"$f":"IF(HA22=\"\",\"\",ROUND((HA24+HA28+HA30)/('Allgemeine Angaben'!$C$15-Verbraucher!HA22),3))","v":""},{"$f":"IF(HB22=\"\",\"\",ROUND((HB24+HB28+HB30)/('Allgemeine Angaben'!$C$15-Verbraucher!HB22),3))","v":""},{"$f":"IF(HC22=\"\",\"\",ROUND((HC24+HC28+HC30)/('Allgemeine Angaben'!$C$15-Verbraucher!HC22),3))","v":""},{"$f":"IF(HD22=\"\",\"\",ROUND((HD24+HD28+HD30)/('Allgemeine Angaben'!$C$15-Verbraucher!HD22),3))","v":""},{"$f":"IF(HE22=\"\",\"\",ROUND((HE24+HE28+HE30)/('Allgemeine Angaben'!$C$15-Verbraucher!HE22),3))","v":""},{"$f":"IF(HF22=\"\",\"\",ROUND((HF24+HF28+HF30)/('Allgemeine Angaben'!$C$15-Verbraucher!HF22),3))","v":""},{"$f":"IF(HG22=\"\",\"\",ROUND((HG24+HG28+HG30)/('Allgemeine Angaben'!$C$15-Verbraucher!HG22),3))","v":""},{"$f":"IF(HH22=\"\",\"\",ROUND((HH24+HH28+HH30)/('Allgemeine Angaben'!$C$15-Verbraucher!HH22),3))","v":""},{"$f":"IF(HI22=\"\",\"\",ROUND((HI24+HI28+HI30)/('Allgemeine Angaben'!$C$15-Verbraucher!HI22),3))","v":""},{"$f":"IF(HJ22=\"\",\"\",ROUND((HJ24+HJ28+HJ30)/('Allgemeine Angaben'!$C$15-Verbraucher!HJ22),3))","v":""},{"$f":"IF(HK22=\"\",\"\",ROUND((HK24+HK28+HK30)/('Allgemeine Angaben'!$C$15-Verbraucher!HK22),3))","v":""},{"$f":"IF(HL22=\"\",\"\",ROUND((HL24+HL28+HL30)/('Allgemeine Angaben'!$C$15-Verbraucher!HL22),3))","v":""},{"$f":"IF(HM22=\"\",\"\",ROUND((HM24+HM28+HM30)/('Allgemeine Angaben'!$C$15-Verbraucher!HM22),3))","v":""},{"$f":"IF(HN22=\"\",\"\",ROUND((HN24+HN28+HN30)/('Allgemeine Angaben'!$C$15-Verbraucher!HN22),3))","v":""},{"$f":"IF(HO22=\"\",\"\",ROUND((HO24+HO28+HO30)/('Allgemeine Angaben'!$C$15-Verbraucher!HO22),3))","v":""},{"$f":"IF(HP22=\"\",\"\",ROUND((HP24+HP28+HP30)/('Allgemeine Angaben'!$C$15-Verbraucher!HP22),3))","v":""},{"$f":"IF(HQ22=\"\",\"\",ROUND((HQ24+HQ28+HQ30)/('Allgemeine Angaben'!$C$15-Verbraucher!HQ22),3))","v":""},{"$f":"IF(HR22=\"\",\"\",ROUND((HR24+HR28+HR30)/('Allgemeine Angaben'!$C$15-Verbraucher!HR22),3))","v":""},{"$f":"IF(HS22=\"\",\"\",ROUND((HS24+HS28+HS30)/('Allgemeine Angaben'!$C$15-Verbraucher!HS22),3))","v":""},{"$f":"IF(HT22=\"\",\"\",ROUND((HT24+HT28+HT30)/('Allgemeine Angaben'!$C$15-Verbraucher!HT22),3))","v":""},{"$f":"IF(HU22=\"\",\"\",ROUND((HU24+HU28+HU30)/('Allgemeine Angaben'!$C$15-Verbraucher!HU22),3))","v":""},{"$f":"IF(HV22=\"\",\"\",ROUND((HV24+HV28+HV30)/('Allgemeine Angaben'!$C$15-Verbraucher!HV22),3))","v":""},{"$f":"IF(HW22=\"\",\"\",ROUND((HW24+HW28+HW30)/('Allgemeine Angaben'!$C$15-Verbraucher!HW22),3))","v":""},{"$f":"IF(HX22=\"\",\"\",ROUND((HX24+HX28+HX30)/('Allgemeine Angaben'!$C$15-Verbraucher!HX22),3))","v":""},{"$f":"IF(HY22=\"\",\"\",ROUND((HY24+HY28+HY30)/('Allgemeine Angaben'!$C$15-Verbraucher!HY22),3))","v":""},{"$f":"IF(HZ22=\"\",\"\",ROUND((HZ24+HZ28+HZ30)/('Allgemeine Angaben'!$C$15-Verbraucher!HZ22),3))","v":""},{"$f":"IF(IA22=\"\",\"\",ROUND((IA24+IA28+IA30)/('Allgemeine Angaben'!$C$15-Verbraucher!IA22),3))","v":""},{"$f":"IF(IB22=\"\",\"\",ROUND((IB24+IB28+IB30)/('Allgemeine Angaben'!$C$15-Verbraucher!IB22),3))","v":""},{"$f":"IF(IC22=\"\",\"\",ROUND((IC24+IC28+IC30)/('Allgemeine Angaben'!$C$15-Verbraucher!IC22),3))","v":""},{"$f":"IF(ID22=\"\",\"\",ROUND((ID24+ID28+ID30)/('Allgemeine Angaben'!$C$15-Verbraucher!ID22),3))","v":""},{"$f":"IF(IE22=\"\",\"\",ROUND((IE24+IE28+IE30)/('Allgemeine Angaben'!$C$15-Verbraucher!IE22),3))","v":""},{"$f":"IF(IF22=\"\",\"\",ROUND((IF24+IF28+IF30)/('Allgemeine Angaben'!$C$15-Verbraucher!IF22),3))","v":""},{"$f":"IF(IG22=\"\",\"\",ROUND((IG24+IG28+IG30)/('Allgemeine Angaben'!$C$15-Verbraucher!IG22),3))","v":""},{"$f":"IF(IH22=\"\",\"\",ROUND((IH24+IH28+IH30)/('Allgemeine Angaben'!$C$15-Verbraucher!IH22),3))","v":""},{"$f":"IF(II22=\"\",\"\",ROUND((II24+II28+II30)/('Allgemeine Angaben'!$C$15-Verbraucher!II22),3))","v":""},{"$f":"IF(IJ22=\"\",\"\",ROUND((IJ24+IJ28+IJ30)/('Allgemeine Angaben'!$C$15-Verbraucher!IJ22),3))","v":""},{"$f":"IF(IK22=\"\",\"\",ROUND((IK24+IK28+IK30)/('Allgemeine Angaben'!$C$15-Verbraucher!IK22),3))","v":""},{"$f":"IF(IL22=\"\",\"\",ROUND((IL24+IL28+IL30)/('Allgemeine Angaben'!$C$15-Verbraucher!IL22),3))","v":""},{"$f":"IF(IM22=\"\",\"\",ROUND((IM24+IM28+IM30)/('Allgemeine Angaben'!$C$15-Verbraucher!IM22),3))","v":""},{"$f":"IF(IN22=\"\",\"\",ROUND((IN24+IN28+IN30)/('Allgemeine Angaben'!$C$15-Verbraucher!IN22),3))","v":""},{"$f":"IF(IO22=\"\",\"\",ROUND((IO24+IO28+IO30)/('Allgemeine Angaben'!$C$15-Verbraucher!IO22),3))","v":""},{"$f":"IF(IP22=\"\",\"\",ROUND((IP24+IP28+IP30)/('Allgemeine Angaben'!$C$15-Verbraucher!IP22),3))","v":""},{"$f":"IF(IQ22=\"\",\"\",ROUND((IQ24+IQ28+IQ30)/('Allgemeine Angaben'!$C$15-Verbraucher!IQ22),3))","v":""},{"$f":"IF(IR22=\"\",\"\",ROUND((IR24+IR28+IR30)/('Allgemeine Angaben'!$C$15-Verbraucher!IR22),3))","v":""},{"$f":"IF(IS22=\"\",\"\",ROUND((IS24+IS28+IS30)/('Allgemeine Angaben'!$C$15-Verbraucher!IS22),3))","v":""},{"$f":"IF(IT22=\"\",\"\",ROUND((IT24+IT28+IT30)/('Allgemeine Angaben'!$C$15-Verbraucher!IT22),3))","v":""},{"$f":"IF(IU22=\"\",\"\",ROUND((IU24+IU28+IU30)/('Allgemeine Angaben'!$C$15-Verbraucher!IU22),3))","v":""},{"$f":"IF(IV22=\"\",\"\",ROUND((IV24+IV28+IV30)/('Allgemeine Angaben'!$C$15-Verbraucher!IV22),3))","v":""}]
[null,null,{"$f":"IF(C$24=\"\",\"\",ROUND(C$24*C$25,3))","v":870},{"$f":"IF(D$24=\"\",\"\",ROUND(D$24*D$25,3))","v":399.5},"",7,"","","","","","","","","","","","","","","","","","","","","","","","","","","","","","","","","","","","","","","","","","","","","","","","","","","","","","","","","","","","","",{"$f":"IF(BP$24=\"\",\"\",ROUND(BP$24*BP$25,3))","v":""},"","","","","","","","","","","","","","","","","","","","","","","","","","","","","","","","","","","","","","","","","","","","","","","","","","","","","","","","","","","","","","","",{"$f":"IF(EB$24=\"\",\"\",ROUND(EB$24*EB$25,3))","v":""},"","","","","","","","","","","","","","","","","","","","","","","","","","","","","","","","","","","","","","","","","","","","","","","","","","","","","","","","","","","","","","","",{"$f":"IF(GN$24=\"\",\"\",ROUND(GN$24*GN$25,3))","v":""},"","","","","","","","","","","","","","","","","","","","","","","","","","","","","","","","","","","","","","","","","","","","","","","","","","","","","","","","","","","",""]
[null,null,{"$f":"IF(C$24=\"\",\"\",ROUND(C$24*C$26,3))","v":870},{"$f":"IF(D$24=\"\",\"\",ROUND(D$24*D$26,3))","v":470},"",10,"","","","","","","","","","","","","","","","","","","","","","","","","","","","","","","","","","","","","","","","","","","","","","","","","","","","","","","","","","","","","",{"$f":"IF(BP$24=\"\",\"\",ROUND(BP$24*BP$26,3))","v":""},"","","","","","","","","","","","","","","","","","","","","","","","","","","","","","","","","","","","","","","","","","","","","","","","","","","","","","","","","","","","","","","",{"$f":"IF(EB$24=\"\",\"\",ROUND(EB$24*EB$26,3))","v":""},"","","","","","","","","","","","","","","","","","","","","","","","","","","","","","","","","","","","","","","","","","","","","","","","","","","","","","","","","","","","","","","",{"$f":"IF(GN$24=\"\",\"\",ROUND(GN$24*GN$26,3))","v":""},"","","","","","","","","","","","","","","","","","","","","","","","","","","","","","","","","","","","","","","","","","","","","","","","","","","","","","","","","","","",""]

{"sheet":"Allgemeine Angaben","index":1,"n_rows":47,"n_cols":5,"rows_kept":47,"cut":false,"hidden":false,"merged":[]}
[{"$f":"Verbraucher!A1","v":"QM Chauffages au bois - Relevée de situation"}]
[{"$f":"Verbraucher!A3","v":"Projet/Variante:"},{"$f":"IF(Verbraucher!B3=\"\",\"\",Verbraucher!B3)","v":"Exemple modèle (ligne 1)"}]
[null,{"$f":"IF(Verbraucher!B4=\"\",\"\",Verbraucher!B4)","v":"Exemple modèle (ligne 2)"}]
[null,{"$f":"IF(Verbraucher!B5=\"\",\"\",Verbraucher!B5)","v":"Exemple modèle (ligne 3)"}]
[{"$f":"Verbraucher!A6","v":"Saisi par: "},{"$f":"IF(Verbraucher!B6=\"\",\"\",Verbraucher!B6)","v":"Concepteur modèle"}]
[{"$f":"Verbraucher!A7","v":"Date:"},{"$f":"IF(Verbraucher!B7=\"\",\"\",Verbraucher!B7)","v":"2022-02-18"}]
[]
[{"$f":"Text!C54","v":"Données planificateur principale"}]
[]
[{"$f":"Text!C55","v":"Généralités"},{"$f":"Text!C56","v":"Pays"}]
[null,{"$f":"Text!C57","v":"Station climatologique"}]
[null,{"$f":"Text!C58","v":"Température extérieure plus basse [°C]"},{"$f":"D12","v":-7},{"$f":"Hilfsblatt!C31","v":-7},{"$f":"IF(Hilfsblatt!AL1=4,Text!C59,IF(Hilfsblatt!AL1=5,Text!C60,Text!C61))","v":"°C = valeur moyenne 10 ans (2002 - 2011)"}]
[null,{"$f":"Text!C62","v":"Température ambiante [°C]"},21]
[null,{"$f":"Text!C63","v":"Limite de chauffage [°C]"},15]
[null,{"$f":"Text!C64","v":"Température aller principale max. [°C]"},85]
[null,{"$f":"Text!C65","v":"Exploitation estivale"}]
[{"$f":"Text!C66","v":"Chaleur ambiante"},{"$f":"Text!C67","v":"Part de la puissance thermique requise chaleur ambiante non dépendante de la température extérieure [%]"},5]
[null,{"$f":"Text!C68","v":"Facteur de simultanéité chaleur ambiante [-]"},1]
[{"$f":"Text!C69","v":"Eau chaude"},{"$f":"Text!C70","v":"Facteur de simultanéité eau chaude [-]"},1]
[{"$f":"Text!C71","v":"Chaleur industrielle"},{"$f":"Text!C72","v":"Facteur de simultanéité chaleur industrielle [-]"},0.56000000000000005]
[{"$f":"Text!C73","v":"Conduite à distance"},{"$f":"Text!C74","v":"Perte de chaleur annuelle conduite à distance [MWh/a]"},{"$f":"ROUND(C33*0.11,1)","v":432.6}]
[null,{"$f":"Text!C75","v":"Perte de puissance conduite à distance [kW]"},{"$f":"ROUND(C21*1000/8760,1)","v":49.4}]
[]
[{"$f":"Text!C77","v":"Valeurs cumulées calculées"}]
[]
[{"$f":"Text!C78","v":"Généralités"},{"$f":"Text!C79","v":"Surface de référence énergétique totale [m²]"},{"$f":"SUM(Verbraucher!C20:IV20)","v":30400}]
[{"$f":"Text!C66","v":"Chaleur ambiante"},{"$f":"Text!C81","v":"Besoin de chaleur total [MWh/a]"},{"$f":"SUM(Verbraucher!C23:IV23)","v":2792}]
[null,{"$f":"Text!C82","v":"Puissance thermique totale requise chaleur ambiante max. [kW]"},{"$f":"SUM(Verbraucher!C24:IV24)","v":1350}]
[{"$f":"Text!C83","v":"Eau chaude"},{"$f":"Text!C84","v":"Besoin de chaleur annuel total eau chaude [MWh/a]"},{"$f":"SUM(Verbraucher!C27:IV27)","v":641}]
[null,{"$f":"Text!C85","v":"Puissance thermique totale requise eau chaude max. [kW]"},{"$f":"SUM(Verbraucher!C28:IV28)","v":262.5}]
[{"$f":"Text!C86","v":"Chaleur industrielle"},{"$f":"Text!C87","v":"Besoin de chaleur annuel total chaleur industrielle [MWh/a]"},{"$f":"SUM(Verbraucher!C29:IV29)","v":500}]
[null,{"$f":"Text!C88","v":"Puissance thermique totale requise chaleur industrielle max. [kW]"},{"$f":"SUM(Verbraucher!C30:IV30)","v":110}]
[{"$f":"Text!C89","v":"∑ des consommateurs"},{"$f":"Text!C90","v":"Besoin de chaleur globale [MWh/a]"},{"$f":"C27+C29+C31","v":3933}]
[null,{"$f":"Text!C91","v":"Puissance thermique à installer globale [kW]"},{"$f":"C28+C30+C32","v":1722.5}]
[]
[{"$f":"Text!C93","v":"Données caractéristiques calculées"}]
[]
[{"$f":"Text!C94","v":"Généralités"},{"$f":"Text!C95","v":"Température aller consommateurs max. [°C]"},{"$f":"MAX(Verbraucher!C21:IV21)","v":80}]
[null,{"$f":"Text!C96","v":"Température retour principale max. [°C]"},{"$f":"ROUND(C15-(C28+C30+C32)/SUM(Verbraucher!C52:IV52),3)","v":52.621000000000002}]
[{"$f":"Text!C66","v":"Chaleur ambiante"},{"$f":"Text!C98","v":"Heures de marche à pleine charge chaleur ambiante [h/a]"},{"$f":"ROUND(C27*1000/C28,2)","v":2068.15}]
[null,{"$f":"Text!C99","v":"Besoin de chaleur spécifique [kWh/m²a]"},{"$f":"ROUND(C27*1000/C$26,3)","v":91.841999999999999}]
[null,{"$f":"Text!C100","v":"Puissance thermique spécifique requise [W/m²]"},{"$f":"ROUND(C28*1000/C$26,3)","v":44.408000000000001}]
[{"$f":"Text!C101","v":"Eau chaude"},{"$f":"Text!C102","v":"Heures de marche à pleine charge eau chaude [h/a]"},{"$f":"ROUND(C29*1000/C30,2)","v":2441.9}]
[null,{"$f":"Text!C103","v":"Besoin d'énergie spécifique eau chaude [kWh/m²a]"},{"$f":"ROUND(C29*1000/C$26,3)","v":21.085999999999999}]
[{"$f":"Text!C104","v":"Chaleur industrielle"},{"$f":"Text!C105","v":"Heures de marche à pleine charge chaleur industrielle [h/a]"},{"$f":"ROUND(C31*1000/C32,2)","v":4545.45}]
[null,{"$f":"Verbraucher!B46","v":"Relevé de situation V37"}]
[{"$f":"Verbraucher!A46","v":"Champs a remplir"},{"$f":"Verbraucher!B47","v":"Format de fichier: .xlsm"}]

{"sheet":"Wärmezentrale","index":2,"n_rows":47,"n_cols":17,"rows_kept":47,"cut":false,"hidden":false,"merged":[[42,1,42,2],[42,3,42,5],[42,6,42,7],[41,1,41,5],[41,6,41,8]]}
[{"$f":"Verbraucher!A1","v":"QM Chauffages au bois - Relevée de situation"}]
[{"$f":"Verbraucher!A3","v":"Projet/Variante:"},{"$f":"IF(Verbraucher!B3=\"\",\"\",Verbraucher!B3)","v":"Exemple modèle (ligne 1)"}]
[null,{"$f":"IF(Verbraucher!B4=\"\",\"\",Verbraucher!B4)","v":"Exemple modèle (ligne 2)"}]
[null,{"$f":"IF(Verbraucher!B5=\"\",\"\",Verbraucher!B5)","v":"Exemple modèle (ligne 3)"}]
[{"$f":"Verbraucher!A6","v":"Saisi par: "},{"$f":"IF(Verbraucher!B6=\"\",\"\",Verbraucher!B6)","v":"Concepteur modèle"}]
[{"$f":"Verbraucher!A7","v":"Date:"},{"$f":"IF(Verbraucher!B7=\"\",\"\",Verbraucher!B7)","v":"2022-02-18"}]
[]
[{"$f":"Text!C200","v":"Données planificateur principale"}]
[]
[{"$f":"Text!C205","v":"Centrale de chauffage"},{"$f":"Text!C206","v":"Solution Standard de QM"},null,null,null,null,null,null,null,null,"WE6",{"$f":"IF(K10=Text!C238,Text!C246,IF(K10=Text!C239,Text!C247,IF(K10=Text!C240,Text!C248,IF(K10=Text!C241,Text!C249,IF(K10=Text!C242,Text!C250,IF(K10=Text!C243,Text!C251,IF(K10=Text!C244,Text!C252,IF(K10=Text!C245,Text!C253,Text!C233))))))))","v":"2 chaudières à bois avec accumulateur"}]
[null,{"$f":"Text!C207","v":"Puissance nominale chaudière à bois 1 (petit chaudière WE1 – WE8) [kW]"},null,null,null,null,null,null,null,null,450,{"$f":"IF(ISBLANK(K11),Text!C234,\"\")","v":""}]
[null,{"$f":"Text!C208","v":"Puissance nominale chaudière à bois 2 (grande chaudière WE1 – WE8) [kW]"},null,null,null,null,null,null,null,null,1000,{"$f":"IF(AND(ISBLANK(K12),OR(K10=Text!C242,K10=Text!C243,K10=Text!C244,K10=Text!C245,K10=Text!C204)),Text!C234,IF(AND(ISBLANK(K12)=FALSE,OR(K10=Text!C238,K10=Text!C239,K10=Text!C240,K10=Text!C241)),Text!C235,\"\"))","v":""}]
[null,{"$f":"Text!C209","v":"Puissance nominale plus chaudière à bois totale [kW]"},null,null,null,null,null,null,null,null,null,{"$f":"IF(AND(ISBLANK(K13),K10=Text!C204),Text!C234,IF(AND(ISBLANK(K13)=FALSE,OR(K10=Text!C238,K10=Text!C239,K10=Text!C240,K10=Text!C241,K10=Text!C242,K10=Text!C243,K10=Text!C244,K10=Text!C245)),Text!C235,\"\"))","v":""}]
[null,{"$f":"Text!C210","v":"Nombre de chaudière à bois installé dans les systèmes à plusieurs chaudières à bois"},null,null,null,null,null,null,null,null,null,{"$f":"IF(AND(ISBLANK(K14),K10=Text!C204),Text!C234,IF(AND(ISBLANK(K14)=FALSE,OR(K10=Text!C238,K10=Text!C239,K10=Text!C240,K10=Text!C241,K10=Text!C242,K10=Text!C243,K10=Text!C244,K10=Text!C245)),Text!C235,\"\"))","v":""}]
[null,{"$f":"Text!C211","v":"Puissance nominale chaudière à bois totale [kW]"},null,null,null,null,null,null,null,null,{"$f":"K11+K12+K13","v":1450}]
[null,{"$f":"Text!C212","v":"Puissance chaudière mazout/gaz totale [kW]"},null,null,null,null,null,null,null,null,null,{"$f":"IF(AND(ISBLANK(K16),OR(K10=Text!C240,K10=Text!C241,K10=Text!C244,K10=Text!C245)),Text!C234,IF(AND(ISBLANK(K16)=FALSE,OR(K10=Text!C238,K10=Text!C239,K10=Text!C242,K10=Text!C243)),Text!C235,\"\"))","v":""}]
[]
[null,{"$f":"Text!C213","v":"Volume de l'accumulateur installée [m3]"},null,null,null,null,null,null,null,null,30,{"$f":"IF(AND(ISBLANK(K18),OR(K10=Text!C239,K10=Text!C241,K10=Text!C243,K10=Text!C245,K10=Text!C204)),Text!C234,IF(AND(ISBLANK(K18)=FALSE,OR(K10=Text!C238,K10=Text!C240,K10=Text!C242,K10=Text!C244)),Text!C235,\"\"))","v":""}]
[null,{"$f":"Text!C214","v":"Le différentiel de température à travers l'accumulateur (départ – retour) [K]"},null,null,null,null,null,null,null,{"$f":"IF(OR(K10=Text!C239,K10=Text!C241,K10=Text!C243,K10=Text!C245,K10=Text!C204),\"*\"&ROUND('Allgemeine Angaben'!C15-'Allgemeine Angaben'!C39,1)&\" K\",\"\")","v":"*32.4 K"},30,{"$f":"IF(AND(ISBLANK(K19),OR(K10=Text!C239,K10=Text!C241,K10=Text!C243,K10=Text!C245,K10=Text!C204)),Text!C234,IF(AND(ISBLANK(K19)=FALSE,OR(K10=Text!C238,K10=Text!C240,K10=Text!C242,K10=Text!C244)),Text!C235,\"\"))","v":""}]
[null,{"$f":"Text!C215","v":"Moyenne de charge de chauffe journalière minimale en cas de fonctionnement à faible charge (voir tableau ci-dessous) [kW]"},null,null,null,null,null,null,null,null,0.15,{"$f":"IF(ISBLANK(K20),Text!C236,\"\")","v":""}]
[null,{"$f":"Text!C216","v":"Performance journalière moyenne maximale de la chaudière à bois (valeur de 70% à 100%)"},null,null,null,null,null,null,null,null,0.9,{"$f":"IF(ISBLANK(K21),Text!C237,\"\")","v":""}]
[null,{"$f":"Text!C256","v":"Performance journalière moyenne maximale de la source de puissance de base [kW]"},null,null,null,null,null,null,null,null,0]
[null,{"$f":"\"* \"&Text!C255","v":"* Écart de température calcul des données d'entrée"}]
[]
[{"$f":"Text!C201","v":"Données caractéristiques calculées"},null,null,null,null,null,null,null,null,null,{"$f":"Text!C230","v":"Résultat"},{"$f":"Text!C231","v":"Valeur de comparaison"}]
[]
[{"$f":"Text!C205","v":"Centrale de chauffage"},{"$f":"Text!C217","v":"Nombre d'heures de fonctionnement à pleine charge (chaudière à bois) [h/a]"},null,null,null,null,null,null,null,null,{"$f":"Hilfsblatt!I11*1000/Wärmezentrale!K15*(Hilfsblatt!L15/100)","v":3010.7638055919556},{"$f":"IF(K10=Text!C238,1500,IF(K10=Text!C239,2000,IF(K10=Text!C240,2500,IF(K10=Text!C241,3500,IF(K10=Text!C242,1500,IF(K10=Text!C243,2000,IF(K10=Text!C244,2500,IF(K10=Text!C245,3000,\"–\"))))))))","v":2000},{"$f":"Text!C227","v":"Résultat ≥ une valeur de comparaison"}]
[null,{"$f":"Text!C218","v":"Nombre d'heures de fonctionnement à pleine charge (chaudière mazout/gaz) [h/a]"},null,null,null,null,null,null,null,null,{"$f":"IF(OR(ISNUMBER(K16)=FALSE,K16=0),\"–\",(Hilfsblatt!L11-Hilfsblatt!L12-Hilfsblatt!L13)*1000/Wärmezentrale!K16)","v":"–"},"–"]
[null,{"$f":"Text!C219","v":"Production annuelle de chaleur avec du bois [%]"},null,null,null,null,null,null,null,null,{"$f":"ROUND(Hilfsblatt!L15/100,3)","v":1},{"$f":"IF(K10=Text!C238,1,IF(K10=Text!C239,1,IF(K10=Text!C240,0.8,IF(K10=Text!C241,0.8,IF(K10=Text!C242,1,IF(K10=Text!C243,1,IF(K10=Text!C244,0.8,IF(K10=Text!C245,0.8,1))))))))","v":1},{"$f":"Text!C227","v":"Résultat ≥ une valeur de comparaison"}]
[null,{"$f":"Text!C220","v":"Volume de l'accumulateur [m3]"},null,null,null,null,null,null,null,null,{"$f":"IF(ISBLANK(K18),\"–\",ROUND(K18,1))","v":30},{"$f":"IF(K10=Text!C238,\"–\",IF(K10=Text!C239,K11/(1.14*K19),IF(K10=Text!C240,\"–\",IF(K10=Text!C241,K11/(1.14*K19),IF(K10=Text!C242,\"–\",IF(K10=Text!C243,2*K15/(3*1.14*K19),IF(K10=Text!C244,\"–\",IF(K10=Text!C245,2*K15/(3*1.14*K19),2*K15/(3*1.14*K19)))))))))","v":28.265107212475634},{"$f":"Text!C227","v":"Résultat ≥ une valeur de comparaison"}]
[null,{"$f":"Text!C221","v":"Cas de fonctionnement à faible charge [kW]"},null,null,null,null,null,null,null,null,{"$f":"ROUND(K20*K11,1)","v":67.5},{"$f":"IF(Hilfsblatt!S1=\"Nein\",Hilfsblatt!F19-Hilfsblatt!AA31,Hilfsblatt!F20-Hilfsblatt!AA31)","v":179.65199999999999},{"$f":"Text!C228","v":"Résultat ≤ une valeur de comparaison (valeur cible)"},null,"Untere Grenze","Obere Grenze","zur Beurteilung"]
[null,{"$f":"IF(K10=Text!C238,Text!C222,IF(K10=Text!C239,Text!C222,IF(K10=Text!C240,Text!C222,IF(K10=Text!C241,Text!C222,IF(K10=Text!C242,Text!C223,IF(K10=Text!C243,Text!C223,IF(K10=Text!C244,Text!C223,IF(K10=Text!C245,Text!C223,Text!C222))))))))","v":"Dimensionnement de la puissance de la chaudière à bois 1"},null,null,null,null,null,null,null,null,{"$f":"IF(K10=Text!C238,K11/Hilfsblatt!F5,IF(K10=Text!C239,K11/Hilfsblatt!F18,IF(K10=Text!C240,K11/Hilfsblatt!F5,IF(K10=Text!C241,K11/Hilfsblatt!F5,IF(K10=Text!C242,K11/Hilfsblatt!F5,IF(K10=Text!C243,K11/Hilfsblatt!F18,IF(K10=Text!C244,K11/Hilfsblatt!F5,IF(K10=Text!C245,K11/Hilfsblatt!F5,K15/Hilfsblatt!F18))))))))","v":0.30903367230893475},{"$f":"IF(K10=Text!C238,\"100%\",IF(K10=Text!C239,\"100%\",IF(K10=Text!C240,\"60% – 70%\",IF(K10=Text!C241,\"50% – 60%\",IF(K10=Text!C242,\"±33%\",IF(K10=Text!C243,\"±33%\",IF(K10=Text!C244,\"20% – 23%\",IF(K10=Text!C245,\"17% – 20%\",\"100%\"))))))))","v":"±33%"},{"$f":"Text!C229","v":"Résultat ≥ ou ≤ à la valeur comparative (zone cible)"},null,{"$f":"IF(K10=Text!C238,1,IF(K10=Text!C239,1,IF(K10=Text!C240,0.6,IF(K10=Text!C241,0.5,IF(K10=Text!C242,0.305,IF(K10=Text!C243,0.305,IF(K10=Text!C244,0.2,IF(K10=Text!C245,0.17,1))))))))","v":0.30499999999999999},{"$f":"IF(K10=Text!C238,1.1,IF(K10=Text!C239,1.1,IF(K10=Text!C240,0.7,IF(K10=Text!C241,0.6,IF(K10=Text!C242,0.38,IF(K10=Text!C243,0.38,IF(K10=Text!C244,0.23,IF(K10=Text!C245,0.2,1.1))))))))","v":0.38}]
[null,{"$f":"IF(K10=Text!C238,\"\",IF(K10=Text!C239,\"\",IF(K10=Text!C240,\"\",IF(K10=Text!C241,\"\",IF(K10=Text!C242,Text!C224,IF(K10=Text!C243,Text!C224,IF(K10=Text!C244,Text!C224,IF(K10=Text!C245,Text!C224,\"\"))))))))","v":"Dimensionnement de la puissance de la chaudière à bois 2"},null,null,null,null,null,null,null,null,{"$f":"IF(K10=Text!C238,\"–\",IF(K10=Text!C239,\"–\",IF(K10=Text!C2338,\"–\",IF(K10=Text!C241,\"–\",IF(K10=Text!C242,K12/Hilfsblatt!F18,IF(K10=Text!C243,K12/Hilfsblatt!F18,IF(K10=Text!C244,K12/Hilfsblatt!F5,IF(K10=Text!C245,K12/Hilfsblatt!F5,\"–\"))))))))","v":0.68674149401985507},{"$f":"IF(K10=Text!C238,\"–\",IF(K10=Text!C239,\"–\",IF(K10=Text!C240,\"–\",IF(K10=Text!C241,\"–\",IF(K10=Text!C242,\"±67%\",IF(K10=Text!C243,\"±67%\",IF(K10=Text!C244,\"40% – 47%\",IF(K10=Text!C245,\"33% – 40%\",\"–\"))))))))","v":"±67%"},{"$f":"Text!C229","v":"Résultat ≥ ou ≤ à la valeur comparative (zone cible)"},null,{"$f":"IF(K10=Text!C238,\"–\",IF(K10=Text!C239,\"–\",IF(K10=Text!C240,\"–\",IF(K10=Text!C241,\"–\",IF(K10=Text!C242,0.645,IF(K10=Text!C243,0.645,IF(K10=Text!C244,0.4,IF(K10=Text!C245,0.33,\"–\"))))))))","v":0.64500000000000002},{"$f":"IF(K10=Text!C238,\"–\",IF(K10=Text!C239,\"–\",IF(K10=Text!C240,\"–\",IF(K10=Text!C241,\"–\",IF(K10=Text!C242,0.72,IF(K10=Text!C243,0.72,IF(K10=Text!C244,0.47,IF(K10=Text!C245,0.4,\"–\"))))))))","v":0.72}]
[null,{"$f":"IF(K10=Text!C238,\"\",IF(K10=Text!C239,\"\",IF(K10=Text!C240,\"\",IF(K10=Text!C241,\"\",IF(K10=Text!C242,Text!C225,IF(K10=Text!C243,Text!C225,IF(K10=Text!C244,Text!C225,IF(K10=Text!C245,Text!C225,\"\"))))))))","v":"Totalement"},null,null,null,null,null,null,null,null,{"$f":"IF(K10=Text!C238,\"–\",IF(K10=Text!C239,\"–\",IF(K10=Text!C240,\"–\",IF(K10=Text!C241,\"–\",IF(K10=Text!C242,K32+K33,IF(K10=Text!C243,K32+K33,IF(K10=Text!C244,K32+K33,IF(K10=Text!C245,K32+K33,\"–\"))))))))","v":0.99577516632878982},{"$f":"IF(K10=Text!C238,\"–\",IF(K10=Text!C239,\"–\",IF(K10=Text!C240,\"–\",IF(K10=Text!C241,\"–\",IF(K10=Text!C242,\"100%\",IF(K10=Text!C243,\"100%\",IF(K10=Text!C244,\"60% – 70%\",IF(K10=Text!C245,\"50% – 60%\",\"–\"))))))))","v":"100%"},{"$f":"Text!C229","v":"Résultat ≥ ou ≤ à la valeur comparative (zone cible)"},null,{"$f":"O32+O33","v":0.95},{"$f":"P32+P33","v":1.1000000000000001}]
[null,{"$f":"Text!C226","v":"Dimensionnement de la puissance de la chaudière mazout/gaz [kW]"},null,null,null,null,null,null,null,null,{"$f":"IF(ISBLANK(K16),\"–\",K16)","v":"–"},{"$f":"IF(K10=Text!C238,\"–\",IF(K10=Text!C239,\"–\",IF(K10=Text!C240,ROUND(0.7*Hilfsblatt!F5,0)&\" kW – \"&ROUND(Hilfsblatt!F5,0)&\" kW\",IF(K10=Text!C241,ROUND(0.7*Hilfsblatt!F5,0)&\" kW – \"&ROUND(Hilfsblatt!F5,0)&\" kW\",IF(K10=Text!C242,\"–\",IF(K10=Text!C243,\"–\",IF(K10=Text!C244,ROUND(Hilfsblatt!F5-K11,0)&\" kW – \"&ROUND(Hilfsblatt!F5,0)&\" kW\",IF(K10=Text!C245,ROUND(Hilfsblatt!F5-K11,0)&\" kW – \"&ROUND(Hilfsblatt!F5,0)&\" kW\",\"–\"))))))))","v":"–"},{"$f":"Text!C229","v":"Résultat ≥ ou ≤ à la valeur comparative (zone cible)"},null,{"$f":"IF(K10=Text!C238,\"–\",IF(K10=Text!C239,\"–\",IF(K10=Text!C240,0.7*Hilfsblatt!F5,IF(K10=Text!C241,0.7*Hilfsblatt!F5,IF(K10=Text!C242,\"–\",IF(K10=Text!C243,\"–\",IF(K10=Text!C244,Hilfsblatt!F5-K11,IF(K10=Text!C245,Hilfsblatt!F5-K11,\"–\"))))))))","v":"–"},{"$f":"IF(K10=Text!C238,\"–\",IF(K10=Text!C239,\"–\",IF(K10=Text!C240,Hilfsblatt!F5,IF(K10=Text!C241,Hilfsblatt!F5,IF(K10=Text!C242,\"–\",IF(K10=Text!C243,\"–\",IF(K10=Text!C244,Hilfsblatt!F5,IF(K10=Text!C245,Hilfsblatt!F5,\"–\"))))))))","v":"–"}]
[null,{"$f":"Text!C254","v":"Comparer les données de puissance avec données d'énergie (Figure ci-dessous liens dans Figures)"},null,null,null,null,null,null,null,null,{"$f":"ROUND(Hilfsblatt!J4/Hilfsblatt!I4,3)","v":1},{"$f":"IF(K10=Text!C238,\"100% – 110%\",IF(K10=Text!C239,\"100% – 110%\",IF(K10=Text!C240,\"95% – 105%\",IF(K10=Text!C241,\"95% – 105%\",IF(K10=Text!C242,\"100% – 110%\",IF(K10=Text!C243,\"100% – 110%\",IF(K10=Text!C244,\"95% – 105%\",IF(K10=Text!C245,\"95% – 105%\",\"95% – 105\"))))))))","v":"100% – 110%"},{"$f":"Text!C229","v":"Résultat ≥ ou ≤ à la valeur comparative (zone cible)"},null,{"$f":"IF(K10=Text!C238,1,IF(K10=Text!C239,1,IF(K10=Text!C240,0.95,IF(K10=Text!C241,0.95,IF(K10=Text!C242,1,IF(K10=Text!C243,1,IF(K10=Text!C244,0.95,IF(K10=Text!C245,0.95,0.95))))))))","v":1},{"$f":"IF(K10=Text!C238,1.1,IF(K10=Text!C239,1.1,IF(K10=Text!C240,1.05,IF(K10=Text!C241,1.05,IF(K10=Text!C242,1.1,IF(K10=Text!C243,1.1,IF(K10=Text!C244,1.05,IF(K10=Text!C245,1.05,1.05))))))))","v":1.1000000000000001}]
[null,{"$f":"Verbraucher!B46","v":"Relevé de situation V37"}]
[{"$f":"Text!C52","v":"Champs a remplir"},{"$f":"Text!C37","v":"Format de fichier: .xlsm"}]
[]
[{"$f":"Text!C264","v":"Moyenne de charge de chauffe journalière minimale en cas de fonctionnement à faible charge"}]
[]
[{"$f":"Text!C257","v":"Type de foyer"},{"$f":"Text!C259","v":"Foyer à grille mobile"},null,null,null,null,{"$f":"Text!C260","v":"Foyer à poussée inférieure"}]
[{"$f":"Text!C258","v":"Recommendations"},{"$f":"Text!C261","v":"à allumage automatique"},null,{"$f":"Text!C262","v":"avec maintien du lit de braise"},null,null,{"$f":"Text!C261","v":"à allumage automatique"},null,{"$f":"Text!C262","v":"avec maintien du lit de braise"}]
[{"$f":"Text!C263","v":"Contenu en eau du combustible"},"≤ M35","M35 - 40","≤ M35","M35 - 50","> M50","≤ M35","M35 - 50","≤ M50"]
[{"$f":"Text!C264","v":"Moyenne de charge de chauffe journalière minimale en cas de fonctionnement à faible charge"},0.15,0.2,0.15,0.2,0.3,0.1,0.15,0.15]
[{"$f":"Text!C266","v":"Remarque importante : selon le fabricant de la chaudière à bois, les valeurs peuvent varier légèrement varier. Les valeurs et les recommandations du fabricant de chaudières sont déterminantes."}]
[{"$f":"Text!C265","v":"Correspond au tableau 13.4 du manuel de planification QM Chauffages au bois, 3e édition 2022 de l'édition allemande"}]

{"sheet":"Bilder","index":3,"n_rows":60,"n_cols":24,"rows_kept":60,"cut":false,"hidden":false,"merged":[[36,21,41,27],[43,21,48,27],[50,21,55,27],[22,21,27,27],[6,2,6,6],[10,21,11,26],[13,21,13,27],[15,21,20,27],[29,21,34,27]]}
[{"$f":"Verbraucher!A3","v":"Projet/Variante:"},null,{"$f":"IF(Verbraucher!$B3=\"\",\"\",Verbraucher!$B3)","v":"Exemple modèle (ligne 1)"},null,null,null,null,{"$f":"A1","v":"Projet/Variante:"},null,{"$f":"IF(Verbraucher!$B3=\"\",\"\",Verbraucher!$B3)","v":"Exemple modèle (ligne 1)"},null,null,null,null,{"$f":"A1","v":"Projet/Variante:"},null,{"$f":"IF(Verbraucher!$B3=\"\",\"\",Verbraucher!$B3)","v":"Exemple modèle (ligne 1)"},null,null,null,null,{"$f":"A1","v":"Projet/Variante:"},null,{"$f":"IF(Verbraucher!$B3=\"\",\"\",Verbraucher!$B3)","v":"Exemple modèle (ligne 1)"}]
[null,null,{"$f":"IF(Verbraucher!$B4=\"\",\"\",Verbraucher!$B4)","v":"Exemple modèle (ligne 2)"},null,null,null,null,null,null,{"$f":"IF(Verbraucher!$B4=\"\",\"\",Verbraucher!$B4)","v":"Exemple modèle (ligne 2)"},null,null,null,null,null,null,{"$f":"IF(Verbraucher!$B4=\"\",\"\",Verbraucher!$B4)","v":"Exemple modèle (ligne 2)"},null,null,null,null,null,null,{"$f":"IF(Verbraucher!$B4=\"\",\"\",Verbraucher!$B4)","v":"Exemple modèle (ligne 2)"}]
[null,null,{"$f":"IF(Verbraucher!$B5=\"\",\"\",Verbraucher!$B5)","v":"Exemple modèle (ligne 3)"},null,null,null,null,null,null,{"$f":"IF(Verbraucher!$B5=\"\",\"\",Verbraucher!$B5)","v":"Exemple modèle (ligne 3)"},null,null,null,null,null,null,{"$f":"IF(Verbraucher!$B5=\"\",\"\",Verbraucher!$B5)","v":"Exemple modèle (ligne 3)"},null,null,null,null,null,null,{"$f":"IF(Verbraucher!$B5=\"\",\"\",Verbraucher!$B5)","v":"Exemple modèle (ligne 3)"}]
[{"$f":"Verbraucher!A6","v":"Saisi par: "},null,{"$f":"IF(Verbraucher!$B6=\"\",\"\",Verbraucher!$B6)","v":"Concepteur modèle"},null,null,null,null,{"$f":"A4","v":"Saisi par: "},null,{"$f":"IF(Verbraucher!$B6=\"\",\"\",Verbraucher!$B6)","v":"Concepteur modèle"},null,null,null,null,{"$f":"A4","v":"Saisi par: "},null,{"$f":"IF(Verbraucher!$B6=\"\",\"\",Verbraucher!$B6)","v":"Concepteur modèle"},null,null,null,null,{"$f":"A4","v":"Saisi par: "},null,{"$f":"IF(Verbraucher!$B6=\"\",\"\",Verbraucher!$B6)","v":"Concepteur modèle"}]
[{"$f":"Verbraucher!A7","v":"Date:"},null,{"$f":"IF(Verbraucher!$B7=\"\",\"\",Verbraucher!$B7)","v":"2022-02-18"},null,null,null,null,{"$f":"A5","v":"Date:"},null,{"$f":"IF(Verbraucher!$B7=\"\",\"\",Verbraucher!$B7)","v":"2022-02-18"},null,null,null,null,{"$f":"A5","v":"Date:"},null,{"$f":"IF(Verbraucher!$B7=\"\",\"\",Verbraucher!$B7)","v":"2022-02-18"},null,null,null,null,{"$f":"A5","v":"Date:"},null,{"$f":"IF(Verbraucher!$B7=\"\",\"\",Verbraucher!$B7)","v":"2022-02-18"}]
["Klimastation:",null,{"$f":"Hilfsblatt!G29","v":"Zürich/Fluntern (CH), 556 m ü. M."},null,null,null,null,{"$f":"A6","v":"Klimastation:"},null,{"$f":"C6","v":"Zürich/Fluntern (CH), 556 m ü. M."},null,null,"Vorgabe:","Effektiv:",{"$f":"A6","v":"Klimastation:"},null,{"$f":"C6","v":"Zürich/Fluntern (CH), 556 m ü. M."},null,null,{"$f":"M6","v":"Vorgabe:"},"Effektiv:",{"$f":"A6","v":"Klimastation:"},{"$f":"Hilfsblatt!AK1","v":0},{"$f":"C6","v":"Zürich/Fluntern (CH), 556 m ü. M."}]
[null,null,null,null,null,null,null,null,null,null,null,"Min. mittlere Holzkessel-Tagesleistung  [kW]:",{"$f":"Wärmezentrale!K20*Wärmezentrale!K11","v":67.5},{"$f":"Hilfsblatt!AG29","v":180},null,null,null,null,{"$f":"L7","v":"Min. mittlere Holzkessel-Tagesleistung  [kW]:"},67.5,180]
[{"$f":"Verbraucher!B46","v":"Relevé de situation V37"},null,null,null,null,null,null,null,null,null,null,"Max. mittlere Holzkessel-Tagesleistung  [kW]:",{"$f":"Wärmezentrale!K21*Wärmezentrale!K15","v":1305},{"$f":"Hilfsblatt!AG31","v":1196},null,null,null,null,{"$f":"L8","v":"Max. mittlere Holzkessel-Tagesleistung  [kW]:"},1305,1196]
[null,null,null,null,null,null,null,null,null,null,null,"Max. mittlere Bandquellen-Tagesleist. [kW]:",{"$f":"Wärmezentrale!K22","v":0},{"$f":"Hilfsblatt!Y31","v":0},null,null,null,null,{"$f":"L9","v":"Max. mittlere Bandquellen-Tagesleist. [kW]:"},{"$f":"M9","v":0},{"$f":"N9","v":0}]
[]
[null,null,null,null,null,null,null,null,null,null,null,null,null,null,null,null,null,null,null,null,null,"Bemerkungen zur Situationserfassung"]
[]
[]
[null,null,null,null,null,null,null,null,null,null,null,null,null,null,null,null,null,null,null,null,null,{"$f":"IF(W6=6,\"Abweichende Resultate sind vom Planer zu kommentieren!\",\"\")","v":""}]
[null,null,null,null,null,null,null,null,null,null,null,null,null,null,null,null,null,null,null,null,null,"Diagramm Seite 1 oben:"]
[]
[]
[]
[]
[]
[]
[null,null,null,null,null,null,null,null,null,null,null,null,null,null,null,null,null,null,null,null,null,"Diagramm Seite 1 unten:"]
[]
[]
[]
[]
[]
[]
[null,null,null,null,null,null,null,null,null,null,null,null,null,null,null,null,null,null,null,null,null,"Diagramm Seite 2 oben:"]
[]
[]
[]
[]
[]
[]
[]
[]
[]
[]
[]
[]
[]
[]
[]
[]
[]
[]
[]
[]
[]
[]
[]
[]
[]
[null,null,null,null,null,null,{"$f":"Verbraucher!B46","v":"Relevé de situation V37"},null,null,null,null,null,null,{"$f":"Verbraucher!B46","v":"Relevé de situation V37"},null,null,null,null,null,null,{"$f":"Verbraucher!B46","v":"Relevé de situation V37"}]
["Diagramm oben: ","Ausgezogen die Lastkennlinie der Gesamtanlage; gestrichelt die Lastkennlinie zur Berechnung",null,null,null,null,null,{"$f":"A56","v":"Diagramm oben: "},"Jahresdauerlinie der benötigten Wärmeleistung mit umrahmten Holzkessel- und Bandleistungs-",null,null,null,null,null,{"$f":"H56","v":"Diagramm oben: "},"Gesamt-Wärmeproduktion und Produktionsanteile des Holzkessels und der Bandleistungs-"]
[null,"der Jahresdauerlinie der benötigten Wärmeleistung",null,null,null,null,null,null,"Anteilen",null,null,null,null,null,null,"quelle"]
[]
["Diagramm unten: ","Vergleich Gesamt-Wärmebedarf",null,null,null,null,null,{"$f":"A59","v":"Diagramm unten: "},"Jahresdauerlinien der Aussentemperatur",null,null,null,null,null,{"$f":"H59","v":"Diagramm unten: "},"Gesamt-Wärmeproduktion und Produktionsanteile des Holzkessels und der Bandleistungs-"]
[null,null,null,null,null,null,null,null,null,null,null,null,null,null,null,"quelle in Prozent der Gesamtproduktion"]

{"sheet":"Figures","index":4,"n_rows":60,"n_cols":24,"rows_kept":60,"cut":false,"hidden":true,"merged":[[36,21,41,27],[43,21,48,27],[50,21,55,27],[6,2,6,6],[10,21,11,26],[15,21,20,27],[22,21,27,27],[29,21,34,27]]}
[{"$f":"Verbraucher!A3","v":"Projet/Variante:"},null,{"$f":"IF(Verbraucher!$B3=\"\",\"\",Verbraucher!$B3)","v":"Exemple modèle (ligne 1)"},null,null,null,null,{"$f":"A1","v":"Projet/Variante:"},null,{"$f":"IF(Verbraucher!$B3=\"\",\"\",Verbraucher!$B3)","v":"Exemple modèle (ligne 1)"},null,null,null,null,{"$f":"A1","v":"Projet/Variante:"},null,{"$f":"IF(Verbraucher!$B3=\"\",\"\",Verbraucher!$B3)","v":"Exemple modèle (ligne 1)"},null,null,null,null,{"$f":"A1","v":"Projet/Variante:"},null,{"$f":"IF(Verbraucher!$B3=\"\",\"\",Verbraucher!$B3)","v":"Exemple modèle (ligne 1)"}]
[null,null,{"$f":"IF(Verbraucher!$B4=\"\",\"\",Verbraucher!$B4)","v":"Exemple modèle (ligne 2)"},null,null,null,null,null,null,{"$f":"IF(Verbraucher!$B4=\"\",\"\",Verbraucher!$B4)","v":"Exemple modèle (ligne 2)"},null,null,null,null,null,null,{"$f":"IF(Verbraucher!$B4=\"\",\"\",Verbraucher!$B4)","v":"Exemple modèle (ligne 2)"},null,null,null,null,null,null,{"$f":"IF(Verbraucher!$B4=\"\",\"\",Verbraucher!$B4)","v":"Exemple modèle (ligne 2)"}]
[null,null,{"$f":"IF(Verbraucher!$B5=\"\",\"\",Verbraucher!$B5)","v":"Exemple modèle (ligne 3)"},null,null,null,null,null,null,{"$f":"IF(Verbraucher!$B5=\"\",\"\",Verbraucher!$B5)","v":"Exemple modèle (ligne 3)"},null,null,null,null,null,null,{"$f":"IF(Verbraucher!$B5=\"\",\"\",Verbraucher!$B5)","v":"Exemple modèle (ligne 3)"},null,null,null,null,null,null,{"$f":"IF(Verbraucher!$B5=\"\",\"\",Verbraucher!$B5)","v":"Exemple modèle (ligne 3)"}]
[{"$f":"Verbraucher!A6","v":"Saisi par: "},null,{"$f":"IF(Verbraucher!$B6=\"\",\"\",Verbraucher!$B6)","v":"Concepteur modèle"},null,null,null,null,{"$f":"A4","v":"Saisi par: "},null,{"$f":"IF(Verbraucher!$B6=\"\",\"\",Verbraucher!$B6)","v":"Concepteur modèle"},null,null,null,null,{"$f":"A4","v":"Saisi par: "},null,{"$f":"IF(Verbraucher!$B6=\"\",\"\",Verbraucher!$B6)","v":"Concepteur modèle"},null,null,null,null,{"$f":"A4","v":"Saisi par: "},null,{"$f":"IF(Verbraucher!$B6=\"\",\"\",Verbraucher!$B6)","v":"Concepteur modèle"}]
[{"$f":"Verbraucher!A7","v":"Date:"},null,{"$f":"IF(Verbraucher!$B7=\"\",\"\",Verbraucher!$B7)","v":"2022-02-18"},null,null,null,null,{"$f":"A5","v":"Date:"},null,{"$f":"IF(Verbraucher!$B7=\"\",\"\",Verbraucher!$B7)","v":"2022-02-18"},null,null,null,null,{"$f":"A5","v":"Date:"},null,{"$f":"IF(Verbraucher!$B7=\"\",\"\",Verbraucher!$B7)","v":"2022-02-18"},null,null,null,null,{"$f":"A5","v":"Date:"},null,{"$f":"IF(Verbraucher!$B7=\"\",\"\",Verbraucher!$B7)","v":"2022-02-18"}]
["Station climatologique:",null,{"$f":"Hilfsblatt!G29","v":"Zürich/Fluntern (CH), 556 m ü. M."},null,null,null,null,{"$f":"A6","v":"Station climatologique:"},null,{"$f":"C6","v":"Zürich/Fluntern (CH), 556 m ü. M."},null,null,"Spécification:","Effectif:",{"$f":"A6","v":"Station climatologique:"},null,{"$f":"C6","v":"Zürich/Fluntern (CH), 556 m ü. M."},null,null,{"$f":"M6","v":"Spécification:"},"Effectif:",{"$f":"A6","v":"Station climatologique:"},null,{"$f":"C6","v":"Zürich/Fluntern (CH), 556 m ü. M."}]
[null,null,null,null,null,null,null,null,null,null,null,"Performance journalière moyenne minimale de la chaudière à bois  [kW]:",{"$f":"Wärmezentrale!K20*Wärmezentrale!K11","v":67.5},{"$f":"Hilfsblatt!AG29","v":180},null,null,null,null,{"$f":"L7","v":"Performance journalière moyenne minimale de la chaudière à bois  [kW]:"},67.5,180]
[{"$f":"Verbraucher!B46","v":"Relevé de situation V37"},null,null,null,null,null,null,null,null,null,null,"Performance journalière moyenne maximale de la chaudière à bois  [kW]:",{"$f":"Wärmezentrale!K21*Wärmezentrale!K15","v":1305},{"$f":"Hilfsblatt!AG31","v":1196},null,null,null,null,{"$f":"L8","v":"Performance journalière moyenne maximale de la chaudière à bois  [kW]:"},1305,1196]
[null,null,null,null,null,null,null,null,null,null,null,"Performance journalière moyenne maximale de la source de puissance de base [kW]:",{"$f":"Wärmezentrale!K22","v":0},{"$f":"Hilfsblatt!Y31","v":0},null,null,null,null,{"$f":"L9","v":"Performance journalière moyenne maximale de la source de puissance de base [kW]:"},{"$f":"M9","v":0},{"$f":"N9","v":0}]
[]
[null,null,null,null,null,null,null,null,null,null,null,null,null,null,null,null,null,null,null,null,null,"Remarques sur le relevé de situation"]
[]
[]
[]
[null,null,null,null,null,null,null,null,null,null,null,null,null,null,null,null,null,null,null,null,null,"Graphique Page 1 ci-dessus:"]
[]
[]
[]
[]
[]
[]
[null,null,null,null,null,null,null,null,null,null,null,null,null,null,null,null,null,null,null,null,null,"Graphique Page 1 ci-dessous:"]
[]
[]
[]
[]
[]
[]
[null,null,null,null,null,null,null,null,null,null,null,null,null,null,null,null,null,null,null,null,null,"Graphique Page 2 ci-dessus:"]
[]
[]
[]
[]
[]
[]
[]
[]
[]
[]
[]
[]
[]
[]
[]
[]
[]
[]
[]
[]
[]
[]
[]
[]
[]
[null,null,null,null,null,null,{"$f":"Verbraucher!B46","v":"Relevé de situation V37"},null,null,null,null,null,null,{"$f":"Verbraucher!B46","v":"Relevé de situation V37"},null,null,null,null,null,null,{"$f":"Verbraucher!B46","v":"Relevé de situation V37"}]
["Diagramme en haut: ","Dessinée en continu, la courbe  caractéristique de charge ensemble de l'installation; en traits",null,null,null,null,null,{"$f":"A56","v":"Diagramme en haut: "},"Courbe de distribution annuelle de la puissance thermique à installer avec les parts des",null,null,null,null,null,{"$f":"H56","v":"Diagramme en haut: "},"Production de chaleur globale et parts de production des chaudières à bois et de la source"]
[null,"discontinus, la courbe caractéristique de charge pondérée pour le calcul de la courbe de",null,null,null,null,null,null,"chaudières à bois et de la source de puissance de base encadrées.",null,null,null,null,null,null,"de puissance de base."]
[null,"distribution annuelle de la puissance thermique nécessaire."]
[null,null,null,null,null,null,null,{"$f":"A60","v":"Diagramme en bas: "},"Courbes de distribution annuelle de la température extérieure. ",null,null,null,null,null,{"$f":"H59","v":"Diagramme en bas: "},"Production de chaleur globale et parts de production des chaudières à bois et de la source "]
["Diagramme en bas: ","Comparaison des besoins totaux de chaleur.",null,null,null,null,null,null,null,null,null,null,null,null,null,"de puissance de base, en pourcentage de la production totale."]

{"sheet":"Bilder_IT","index":5,"n_rows":58,"n_cols":24,"rows_kept":58,"cut":false,"hidden":true,"merged":[[35,21,40,27],[42,21,47,27],[49,21,54,27],[5,2,5,6],[9,21,10,26],[14,21,19,27],[21,21,26,27],[28,21,33,27]]}
[{"$f":"Verbraucher!A3","v":"Projet/Variante:"},null,{"$f":"IF(Verbraucher!$B3=\"\",\"\",Verbraucher!$B3)","v":"Exemple modèle (ligne 1)"},null,null,null,null,{"$f":"A1","v":"Projet/Variante:"},null,{"$f":"IF(Verbraucher!$B3=\"\",\"\",Verbraucher!$B3)","v":"Exemple modèle (ligne 1)"},null,null,null,null,{"$f":"A1","v":"Projet/Variante:"},null,{"$f":"IF(Verbraucher!$B3=\"\",\"\",Verbraucher!$B3)","v":"Exemple modèle (ligne 1)"},null,null,null,null,{"$f":"A1","v":"Projet/Variante:"},null,{"$f":"IF(Verbraucher!$B3=\"\",\"\",Verbraucher!$B3)","v":"Exemple modèle (ligne 1)"}]
[null,null,{"$f":"IF(Verbraucher!$B4=\"\",\"\",Verbraucher!$B4)","v":"Exemple modèle (ligne 2)"},null,null,null,null,null,null,{"$f":"IF(Verbraucher!$B4=\"\",\"\",Verbraucher!$B4)","v":"Exemple modèle (ligne 2)"},null,null,null,null,null,null,{"$f":"IF(Verbraucher!$B4=\"\",\"\",Verbraucher!$B4)","v":"Exemple modèle (ligne 2)"},null,null,null,null,null,null,{"$f":"IF(Verbraucher!$B4=\"\",\"\",Verbraucher!$B4)","v":"Exemple modèle (ligne 2)"}]
[null,null,{"$f":"IF(Verbraucher!$B5=\"\",\"\",Verbraucher!$B5)","v":"Exemple modèle (ligne 3)"},null,null,null,null,null,null,{"$f":"IF(Verbraucher!$B5=\"\",\"\",Verbraucher!$B5)","v":"Exemple modèle (ligne 3)"},null,null,null,null,null,null,{"$f":"IF(Verbraucher!$B5=\"\",\"\",Verbraucher!$B5)","v":"Exemple modèle (ligne 3)"},null,null,null,null,null,null,{"$f":"IF(Verbraucher!$B5=\"\",\"\",Verbraucher!$B5)","v":"Exemple modèle (ligne 3)"}]
[{"$f":"Verbraucher!A6","v":"Saisi par: "},null,{"$f":"IF(Verbraucher!$B6=\"\",\"\",Verbraucher!$B6)","v":"Concepteur modèle"},null,null,null,null,{"$f":"A4","v":"Saisi par: "},null,{"$f":"IF(Verbraucher!$B6=\"\",\"\",Verbraucher!$B6)","v":"Concepteur modèle"},null,null,null,null,{"$f":"A4","v":"Saisi par: "},null,{"$f":"IF(Verbraucher!$B6=\"\",\"\",Verbraucher!$B6)","v":"Concepteur modèle"},null,null,null,null,{"$f":"A4","v":"Saisi par: "},null,{"$f":"IF(Verbraucher!$B6=\"\",\"\",Verbraucher!$B6)","v":"Concepteur modèle"}]
["Klimastation:",null,{"$f":"Hilfsblatt!G29","v":"Zürich/Fluntern (CH), 556 m ü. M."},null,null,null,null,{"$f":"A5","v":"Klimastation:"},null,{"$f":"C5","v":"Zürich/Fluntern (CH), 556 m ü. M."},null,null,"Vorgabe:","Effektiv:",{"$f":"A5","v":"Klimastation:"},null,{"$f":"C5","v":"Zürich/Fluntern (CH), 556 m ü. M."},null,null,{"$f":"M5","v":"Vorgabe:"},"Effektiv:",{"$f":"A5","v":"Klimastation:"},null,{"$f":"C5","v":"Zürich/Fluntern (CH), 556 m ü. M."}]
[null,null,{"$f":"IF(Hilfsblatt!T2=2,\"Données seulement actives dans la feuille 'Figures_FR'\",IF(Hilfsblatt!T2=1,\"Eingaben sind nur im Blatt Bilder_DE aktiv!\",\"\"))","v":"Données seulement actives dans la feuille 'Figures_FR'"},null,null,null,null,null,null,null,null,"Min. mittlere Holzkessel-Tagesleistung  [kW]:",150,{"$f":"Hilfsblatt!AG29","v":180},null,null,null,null,{"$f":"L6","v":"Min. mittlere Holzkessel-Tagesleistung  [kW]:"},150,180]
[null,null,null,null,null,null,null,null,null,null,null,"Max. mittlere Holzkessel-Tagesleistung  [kW]:",500,{"$f":"Hilfsblatt!AG31","v":1196},null,null,null,null,{"$f":"L7","v":"Max. mittlere Holzkessel-Tagesleistung  [kW]:"},500,1196]
[null,null,null,null,null,null,null,null,null,null,null,"Max. mittlere Bandquellen-Tagesleist. [kW]:",100,{"$f":"Hilfsblatt!Y31","v":0},null,null,null,null,{"$f":"L8","v":"Max. mittlere Bandquellen-Tagesleist. [kW]:"},{"$f":"M8","v":100},{"$f":"N8","v":0}]
[]
[null,null,null,null,null,null,null,null,null,null,null,null,null,null,null,null,null,null,null,null,null,"Bemerkungen zur Situationserfassung"]
[]
[]
[]
[]
[]
[]
[]
[]
[]
[]
[]
[]
[]
[]
[]
[]
[]
[]
[]
[]
[]
[]
[]
[]
[]
[]
[]
[]
[]
[]
[]
[]
[]
[]
[]
[]
[]
[]
[]
[]
[]
[]
[]
[]
["Diagramm oben: ","Ausgezogen die Lastkennlinie der Gesamtanlage; gestrichelt die Lastkennlinie zur Berechnung",null,null,null,null,null,{"$f":"A55","v":"Diagramm oben: "},"Jahresdauerlinie der benötigten Wärmeleistung und umrahmtem Holzkessel-Anteil",null,null,null,null,null,{"$f":"H55","v":"Diagramm oben: "},"Gesamt-Wärmeproduktion und Produktionsanteil des Holzkessels"]
[null,"der Jahresdauerlinie der benötigten Wärmeleistung"]
[null,null,null,null,null,null,null,{"$f":"A58","v":"Diagramm unten: "},"Jahresdauerlinien der Aussentemperatur",null,null,null,null,null,{"$f":"H57","v":"Diagramm unten: "},"Gesamt-Wärmeproduktion und Produktionsanteil des Holzkessels in Prozent der "]
["Diagramm unten: ","Vergleich Gesamt-Wärmebedarf",null,null,null,null,null,null,null,null,null,null,null,null,null,"Gesamtproduktion"]

{"sheet":"Immagini","index":6,"n_rows":60,"n_cols":24,"rows_kept":60,"cut":false,"hidden":true,"merged":[[36,21,41,27],[43,21,48,27],[50,21,55,27],[6,2,6,6],[10,21,11,26],[13,21,13,27],[15,21,20,27],[22,21,27,27],[29,21,34,27]]}
[{"$f":"Verbraucher!A3","v":"Projet/Variante:"},null,{"$f":"IF(Verbraucher!$B3=\"\",\"\",Verbraucher!$B3)","v":"Exemple modèle (ligne 1)"},null,null,null,null,{"$f":"A1","v":"Projet/Variante:"},null,{"$f":"IF(Verbraucher!$B3=\"\",\"\",Verbraucher!$B3)","v":"Exemple modèle (ligne 1)"},null,null,null,null,{"$f":"A1","v":"Projet/Variante:"},null,{"$f":"IF(Verbraucher!$B3=\"\",\"\",Verbraucher!$B3)","v":"Exemple modèle (ligne 1)"},null,null,null,null,{"$f":"A1","v":"Projet/Variante:"},null,{"$f":"IF(Verbraucher!$B3=\"\",\"\",Verbraucher!$B3)","v":"Exemple modèle (ligne 1)"}]
[null,null,{"$f":"IF(Verbraucher!$B4=\"\",\"\",Verbraucher!$B4)","v":"Exemple modèle (ligne 2)"},null,null,null,null,null,null,{"$f":"IF(Verbraucher!$B4=\"\",\"\",Verbraucher!$B4)","v":"Exemple modèle (ligne 2)"},null,null,null,null,null,null,{"$f":"IF(Verbraucher!$B4=\"\",\"\",Verbraucher!$B4)","v":"Exemple modèle (ligne 2)"},null,null,null,null,null,null,{"$f":"IF(Verbraucher!$B4=\"\",\"\",Verbraucher!$B4)","v":"Exemple modèle (ligne 2)"}]
[null,null,{"$f":"IF(Verbraucher!$B5=\"\",\"\",Verbraucher!$B5)","v":"Exemple modèle (ligne 3)"},null,null,null,null,null,null,{"$f":"IF(Verbraucher!$B5=\"\",\"\",Verbraucher!$B5)","v":"Exemple modèle (ligne 3)"},null,null,null,null,null,null,{"$f":"IF(Verbraucher!$B5=\"\",\"\",Verbraucher!$B5)","v":"Exemple modèle (ligne 3)"},null,null,null,null,null,null,{"$f":"IF(Verbraucher!$B5=\"\",\"\",Verbraucher!$B5)","v":"Exemple modèle (ligne 3)"}]
[{"$f":"Verbraucher!A6","v":"Saisi par: "},null,{"$f":"IF(Verbraucher!$B6=\"\",\"\",Verbraucher!$B6)","v":"Concepteur modèle"},null,null,null,null,{"$f":"A4","v":"Saisi par: "},null,{"$f":"IF(Verbraucher!$B6=\"\",\"\",Verbraucher!$B6)","v":"Concepteur modèle"},null,null,null,null,{"$f":"A4","v":"Saisi par: "},null,{"$f":"IF(Verbraucher!$B6=\"\",\"\",Verbraucher!$B6)","v":"Concepteur modèle"},null,null,null,null,{"$f":"A4","v":"Saisi par: "},null,{"$f":"IF(Verbraucher!$B6=\"\",\"\",Verbraucher!$B6)","v":"Concepteur modèle"}]
[{"$f":"Verbraucher!A7","v":"Date:"},null,{"$f":"IF(Verbraucher!$B7=\"\",\"\",Verbraucher!$B7)","v":"2022-02-18"},null,null,null,null,{"$f":"A5","v":"Date:"},null,{"$f":"IF(Verbraucher!$B7=\"\",\"\",Verbraucher!$B7)","v":"2022-02-18"},null,null,null,null,{"$f":"A5","v":"Date:"},null,{"$f":"IF(Verbraucher!$B7=\"\",\"\",Verbraucher!$B7)","v":"2022-02-18"},null,null,null,null,{"$f":"A5","v":"Date:"},null,{"$f":"IF(Verbraucher!$B7=\"\",\"\",Verbraucher!$B7)","v":"2022-02-18"}]
["Stazione climatica:",null,{"$f":"Hilfsblatt!G29","v":"Zürich/Fluntern (CH), 556 m ü. M."},null,null,null,null,{"$f":"A6","v":"Stazione climatica:"},null,{"$f":"C6","v":"Zürich/Fluntern (CH), 556 m ü. M."},null,null,"Specifiche:","Efficace:",{"$f":"A6","v":"Stazione climatica:"},null,{"$f":"C6","v":"Zürich/Fluntern (CH), 556 m ü. M."},null,null,{"$f":"M6","v":"Specifiche:"},"Efficace:",{"$f":"A6","v":"Stazione climatica:"},{"$f":"Hilfsblatt!AK1","v":0},{"$f":"C6","v":"Zürich/Fluntern (CH), 556 m ü. M."}]
[null,null,null,null,null,null,null,null,null,null,null,"Potenza media giornaliera minima della caldaia a legna [kW]:",{"$f":"Wärmezentrale!K20*Wärmezentrale!K11","v":67.5},{"$f":"Hilfsblatt!AG29","v":180},null,null,null,null,{"$f":"L7","v":"Potenza media giornaliera minima della caldaia a legna [kW]:"},67.5,180]
[{"$f":"Verbraucher!B46","v":"Relevé de situation V37"},null,null,null,null,null,null,null,null,null,null,"Potenza media massima giornaliera della caldaia a legna [kW]:",{"$f":"Wärmezentrale!K21*Wärmezentrale!K15","v":1305},{"$f":"Hilfsblatt!AG31","v":1196},null,null,null,null,{"$f":"L8","v":"Potenza media massima giornaliera della caldaia a legna [kW]:"},1305,1196]
[null,null,null,null,null,null,null,null,null,null,null,"Massima potenza media giorno della fonte di alimentazione di base [kW]:",{"$f":"Wärmezentrale!K22","v":0},{"$f":"Hilfsblatt!Y31","v":0},null,null,null,null,{"$f":"L9","v":"Massima potenza media giorno della fonte di alimentazione di base [kW]:"},{"$f":"M9","v":0},{"$f":"N9","v":0}]
[]
[null,null,null,null,null,null,null,null,null,null,null,null,null,null,null,null,null,null,null,null,null,"Osservazioni "]
[]
[]
[null,null,null,null,null,null,null,null,null,null,null,null,null,null,null,null,null,null,null,null,null,{"$f":"IF(W6=6,\"Abweichende Resultate sind vom Planer zu kommentieren!\",\"\")","v":""}]
[null,null,null,null,null,null,null,null,null,null,null,null,null,null,null,null,null,null,null,null,null,"Diagramma pagina 1 in alto:"]
[]
[]
[]
[]
[]
[]
[null,null,null,null,null,null,null,null,null,null,null,null,null,null,null,null,null,null,null,null,null,"Diagramma pagina 1 in basso:"]
[]
[]
[]
[]
[]
[]
[null,null,null,null,null,null,null,null,null,null,null,null,null,null,null,null,null,null,null,null,null,"Diagramma pagina 2 in alto:"]
[]
[]
[]
[]
[]
[]
[]
[]
[]
[]
[]
[]
[]
[]
[]
[]
[]
[]
[]
[]
[]
[]
[]
[]
[]
[null,null,null,null,null,null,{"$f":"Verbraucher!B46","v":"Relevé de situation V37"},null,null,null,null,null,null,{"$f":"Verbraucher!B46","v":"Relevé de situation V37"},null,null,null,null,null,null,{"$f":"Verbraucher!B46","v":"Relevé de situation V37"}]
["Diagramma sopra:","La curva caratteristica di carico dell'intero sistema è tracciata; la curva caratteristica di carico per il calcolo",null,null,null,null,null,{"$f":"A56","v":"Diagramma sopra:"},"Curva di durata annuale della potenza termica richiesta con caldaia a legna incorniciata ",null,null,null,null,null,{"$f":"H56","v":"Diagramma sopra:"},"Produzione totale di calore e quote di produzione della caldaia a legna e della fonte di alimentazione di base."]
[null,"della curva di durata annuale della potenza termica richiesta è tratteggiata",null,null,null,null,null,null,"e quote di potenza della fonte di alimentazione di base."]
[]
["Diagramma qui sotto:","Confronto della domanda totale di calore",null,null,null,null,null,{"$f":"A59","v":"Diagramma qui sotto:"},"Curve di durata annuale della temperatura esterna",null,null,null,null,null,{"$f":"H59","v":"Diagramma qui sotto:"},"Produzione totale di calore e quote di produzione della caldaia a legna e della fonte di alimentazione di base"]
[null,null,null,null,null,null,null,null,null,null,null,null,null,null,null,"in percentuale della produzione totale."]

{"sheet":"Images","index":7,"n_rows":59,"n_cols":24,"rows_kept":59,"cut":false,"hidden":true,"merged":[[36,21,41,27],[43,21,48,27],[50,21,55,27],[6,2,6,6],[10,21,11,26],[13,21,13,27],[15,21,20,27],[22,21,27,27],[29,21,34,27]]}
[{"$f":"Verbraucher!A3","v":"Projet/Variante:"},null,{"$f":"IF(Verbraucher!$B3=\"\",\"\",Verbraucher!$B3)","v":"Exemple modèle (ligne 1)"},null,null,null,null,{"$f":"A1","v":"Projet/Variante:"},null,{"$f":"IF(Verbraucher!$B3=\"\",\"\",Verbraucher!$B3)","v":"Exemple modèle (ligne 1)"},null,null,null,null,{"$f":"A1","v":"Projet/Variante:"},null,{"$f":"IF(Verbraucher!$B3=\"\",\"\",Verbraucher!$B3)","v":"Exemple modèle (ligne 1)"},null,null,null,null,{"$f":"A1","v":"Projet/Variante:"},null,{"$f":"IF(Verbraucher!$B3=\"\",\"\",Verbraucher!$B3)","v":"Exemple modèle (ligne 1)"}]
[null,null,{"$f":"IF(Verbraucher!$B4=\"\",\"\",Verbraucher!$B4)","v":"Exemple modèle (ligne 2)"},null,null,null,null,null,null,{"$f":"IF(Verbraucher!$B4=\"\",\"\",Verbraucher!$B4)","v":"Exemple modèle (ligne 2)"},null,null,null,null,null,null,{"$f":"IF(Verbraucher!$B4=\"\",\"\",Verbraucher!$B4)","v":"Exemple modèle (ligne 2)"},null,null,null,null,null,null,{"$f":"IF(Verbraucher!$B4=\"\",\"\",Verbraucher!$B4)","v":"Exemple modèle (ligne 2)"}]
[null,null,{"$f":"IF(Verbraucher!$B5=\"\",\"\",Verbraucher!$B5)","v":"Exemple modèle (ligne 3)"},null,null,null,null,null,null,{"$f":"IF(Verbraucher!$B5=\"\",\"\",Verbraucher!$B5)","v":"Exemple modèle (ligne 3)"},null,null,null,null,null,null,{"$f":"IF(Verbraucher!$B5=\"\",\"\",Verbraucher!$B5)","v":"Exemple modèle (ligne 3)"},null,null,null,null,null,null,{"$f":"IF(Verbraucher!$B5=\"\",\"\",Verbraucher!$B5)","v":"Exemple modèle (ligne 3)"}]
[{"$f":"Verbraucher!A6","v":"Saisi par: "},null,{"$f":"IF(Verbraucher!$B6=\"\",\"\",Verbraucher!$B6)","v":"Concepteur modèle"},null,null,null,null,{"$f":"A4","v":"Saisi par: "},null,{"$f":"IF(Verbraucher!$B6=\"\",\"\",Verbraucher!$B6)","v":"Concepteur modèle"},null,null,null,null,{"$f":"A4","v":"Saisi par: "},null,{"$f":"IF(Verbraucher!$B6=\"\",\"\",Verbraucher!$B6)","v":"Concepteur modèle"},null,null,null,null,{"$f":"A4","v":"Saisi par: "},null,{"$f":"IF(Verbraucher!$B6=\"\",\"\",Verbraucher!$B6)","v":"Concepteur modèle"}]
[{"$f":"Verbraucher!A7","v":"Date:"},null,{"$f":"IF(Verbraucher!$B7=\"\",\"\",Verbraucher!$B7)","v":"2022-02-18"},null,null,null,null,{"$f":"A5","v":"Date:"},null,{"$f":"IF(Verbraucher!$B7=\"\",\"\",Verbraucher!$B7)","v":"2022-02-18"},null,null,null,null,{"$f":"A5","v":"Date:"},null,{"$f":"IF(Verbraucher!$B7=\"\",\"\",Verbraucher!$B7)","v":"2022-02-18"},null,null,null,null,{"$f":"A5","v":"Date:"},null,{"$f":"IF(Verbraucher!$B7=\"\",\"\",Verbraucher!$B7)","v":"2022-02-18"}]
["Climate station:",null,{"$f":"Hilfsblatt!G29","v":"Zürich/Fluntern (CH), 556 m ü. M."},null,null,null,null,{"$f":"A6","v":"Climate station:"},null,{"$f":"C6","v":"Zürich/Fluntern (CH), 556 m ü. M."},null,null,"Specification:","Effectively:",{"$f":"A6","v":"Climate station:"},null,{"$f":"C6","v":"Zürich/Fluntern (CH), 556 m ü. M."},null,null,{"$f":"M6","v":"Specification:"},"Effectively:",{"$f":"A6","v":"Climate station:"},{"$f":"Hilfsblatt!AK1","v":0},{"$f":"C6","v":"Zürich/Fluntern (CH), 556 m ü. M."}]
[null,null,null,null,null,null,null,null,null,null,null,"Min. average daily wood boiler output [kW]:",{"$f":"Wärmezentrale!K20*Wärmezentrale!K11","v":67.5},{"$f":"Hilfsblatt!AG29","v":180},null,null,null,null,{"$f":"L7","v":"Min. average daily wood boiler output [kW]:"},67.5,180]
[{"$f":"Verbraucher!B46","v":"Relevé de situation V37"},null,null,null,null,null,null,null,null,null,null,"Max. average daily wood boiler output [kW]:",{"$f":"Wärmezentrale!K21*Wärmezentrale!K15","v":1305},{"$f":"Hilfsblatt!AG31","v":1196},null,null,null,null,{"$f":"L8","v":"Max. average daily wood boiler output [kW]:"},1305,1196]
[null,null,null,null,null,null,null,null,null,null,null,"Max. average base load daily output [kW]:",{"$f":"Wärmezentrale!K22","v":0},{"$f":"Hilfsblatt!Y31","v":0},null,null,null,null,{"$f":"L9","v":"Max. average base load daily output [kW]:"},{"$f":"M9","v":0},{"$f":"N9","v":0}]
[]
[null,null,null,null,null,null,null,null,null,null,null,null,null,null,null,null,null,null,null,null,null,"Remarks"]
[]
[]
[null,null,null,null,null,null,null,null,null,null,null,null,null,null,null,null,null,null,null,null,null,{"$f":"IF(W6=6,\"Abweichende Resultate sind vom Planer zu kommentieren!\",\"\")","v":""}]
[null,null,null,null,null,null,null,null,null,null,null,null,null,null,null,null,null,null,null,null,null,"Diagram page 1 top:"]
[]
[]
[]
[]
[]
[]
[null,null,null,null,null,null,null,null,null,null,null,null,null,null,null,null,null,null,null,null,null,"Diagram page 1 bottom:"]
[]
[]
[]
[]
[]
[]
[null,null,null,null,null,null,null,null,null,null,null,null,null,null,null,null,null,null,null,null,null,"Diagram page 2 top:"]
[]
[]
[]
[]
[]
[]
[]
[]
[]
[]
[]
[]
[]
[]
[]
[]
[]
[]
[]
[]
[]
[]
[]
[]
[]
[null,null,null,null,null,null,{"$f":"Verbraucher!B46","v":"Relevé de situation V37"},null,null,null,null,null,null,{"$f":"Verbraucher!B46","v":"Relevé de situation V37"},null,null,null,null,null,null,{"$f":"Verbraucher!B46","v":"Relevé de situation V37"}]
["Diagram above:","The load characteristic curve of the entire system is drawn out.",null,null,null,null,null,{"$f":"A56","v":"Diagram above:"},"Annual duration curve of the required heat output with framed wood boiler and base load shares",null,null,null,null,null,{"$f":"H56","v":"Diagram above:"},"Total heat production and production shares of the wood boiler and the base load source"]
[null,"The load characteristic curve for calculating the annual duration curve of the required heat output is dashed."]
[null,null,null,null,null,null,null,{"$f":"A59","v":"Diagram below:"},"Annual outdoor temperature curves",null,null,null,null,null,{"$f":"H58","v":"Diagram below:"},"Total heat production and production shares of the wood boiler and the base load source"]
["Diagram below:","Comparison of total heat demand",null,null,null,null,null,null,null,null,null,null,null,null,null,"as a percentage of total production"]

{"sheet":"Text","index":8,"n_rows":266,"n_cols":7,"rows_kept":266,"cut":false,"hidden":true,"merged":[]}
["Blatt","Zelle",{"$f":"Hilfsblatt!T1","v":"F"},"Deutsch","Französisch","Italiano","English"]
[1,"A1",{"$f":"IF(C$1=\"F\",E2,IF(C$1=\"I\",F2,IF(C$1=\"E\",G2,D2)))","v":"QM Chauffages au bois - Relevée de situation"},"QM Holzheizwerke - Situationserfassung","QM Chauffages au bois - Relevée de situation","QM Impianti termici a legna - Analisi domanda di calore","QM for Biomass Plants - Demand assessment"]
[1,"A3",{"$f":"IF(C$1=\"F\",E3,IF(C$1=\"I\",F3,IF(C$1=\"E\",G3,D3)))","v":"Projet/Variante:"},"Projekt/Variante:","Projet/Variante:","Proggetto/Versione","Project/option:"]
[1,"A6","Saisi par: ","Erfasst von:","Saisi par: ","Registrato da:","Editor:"]
[1,"B3","Exemple modèle (ligne 1)","Musterbeispiel (Linie 1)","Exemple modèle (ligne 1)","Esempio (Linea 1)","Example (line 1)"]
[1,"B4","Exemple modèle (ligne 2)","Musterbeispiel (Linie 2)","Exemple modèle (ligne 2)","Esempio (Linea 2)","Example (line 2)"]
[1,"B5","Exemple modèle (ligne 3)","Musterbeispiel (Linie 3)","Exemple modèle (ligne 3)","Esempio (Linea 3)","Example (line 3)"]
[1,"B6","Concepteur modèle","Musterplaner","Concepteur modèle","Progettista del modello","Sample planner"]
[1,"A8","Données planificateur principale","Eingaben Hauptplaner","Données planificateur principale","Inputs del progettista principale","Inputs main planner"]
[1,"A10","Généralités","Allgemeines","Généralités","Informazioni generali","General information"]
[1,"B10","Numéro","Nummer","Numéro","Numero","Number"]
[1,"B11","Indication","Bezeichnung","Indication","Indicazione","Designation"]
[1,"B12",0,"Infozeile 1"]
[1,"B13",0,"Infozeile 2"]
[1,"B14",0,"Infozeile 3"]
[1,"B15",0,"Jahreswärmebedarf / Nutzenergie (MWh/a)"]
[1,"B16",0,"Anteil Warmwasser (-)"]
[1,"B17",0,"Verbraucher Status: 1 = aktiv; 0 = inaktiv"]
[1,"B12","Langue","Sprache:","Langue","Lingua:","Language:"]
[1,"B13","Date:","Datum:","Date:","Data:","Date:"]
[1,"B14","Détermination du besoin de chaleur au moyen de","Wärmebedarfsermittlung anhand","Détermination du besoin de chaleur au moyen de","Calcolo della richiesta di calore sulla base di","Heat demand assessment based on"]
[1,"B15","Surface de référence énergétique [m²]","Energiebezugsfläche [m²]","Surface de référence énergétique [m²]","Superficie disperdente [m²].","Energy reference area [m²]"]
[1,"B16","Température aller max. [°C]","Max. Vorlauftemperatur [°C]","Température aller max. [°C]","Temperatura max. di mandata [°C]","Max. supply temperature [°C]"]
[1,"B17","Température retour max. [°C]","Max. Rücklauftemperatur [°C]","Température retour max. [°C]","Temperatura max. di ritorno [°C]","Max. return temperature [°C]"]
[1,"A18","Chaleur ambiante","Raumwärme","Chaleur ambiante","Calore ambienti","Space heating"]
[1,"B18","Besoin de chaleur [MWh/a]","Heizwärmebedarf [MWh/a]","Besoin de chaleur [MWh/a]","Domanda di calore [MWh/a]","Annual heat demand for space heating [MWh/a]"]
[1,"B19","Puissance thermique requise chaleur ambiante  max. [kW]","Max. Wärmeleistungsbedarf Raumwärme [kW]","Puissance thermique requise chaleur ambiante  max. [kW]","Max. potenza termica per il riscaldamento degli ambienti [kW]","Max. heat capacity for space heating [kW]"]
[1,"B20","Facteur de correction besoin de chaleur [-]","Korrekturfaktor Heizwärmebedarf [-]","Facteur de correction besoin de chaleur [-]","Fattore di correzione per la richiesta di riscaldamento dell'ambiente [-]","Correction factor space heating demand [-]"]
[1,"B21","Facteur de correction pointe de préchauffage [-]","Korrekturfaktor Aufheizspitze [-]","Facteur de correction pointe de préchauffage [-]","Fattore di correzione del picco di riscaldamento [-].","Correction factor heating-up peak [-]"]
[1,"A22","Eau chaude","Warmwasser","Eau chaude","Acqua calda sanitaria","Domestic hot water"]
[1,"B22","Besoin de chaleur annuel eau chaude [MWh/a]*","Jahreswärmebedarf Warmwasser [MWh/a]*","Besoin de chaleur annuel eau chaude [MWh/a]*","Domanda di calore annuale per l'acqua calda sanitaria [MWh/a]*","Annual heat demand for hot water [MWh/a]*"]
[1,"B23","Puissance thermique requise eau chaude max. [kW]","Max. Wärmeleistungsbedarf Warmwasser [kW]","Puissance thermique requise eau chaude max. [kW]","Max. richiesta termica per l'acqua calda sanitaria [kW]","Max. heat capacity for domestic hot water [kW]"]
[1,"A24","Chaleur industrielle","Prozesswärme","Chaleur industrielle","Calore di processo","Process heat"]
[1,"B24","Besoins de chaleur annuel chaleur industrielle [MWh/a]*","Jahreswärmebedarf Prozesswärme [MWh/a]*","Besoins de chaleur annuel chaleur industrielle [MWh/a]*","Domanda annuale del calore di processo [MWh/a]*","Annual heat demand for process heat [MWh/a]*"]
[1,"B25","Puissance thermique requise chaleur industrielle max. [kW]","Max. Wärmeleistungsbedarf Prozesswärme [kW]","Puissance thermique requise chaleur industrielle max. [kW]","Potenza max. richiesta per il calore di processo","Max. heat capacity for process heat [kW]"]
[1,"B41",{"$f":"IF(C$1=\"F\",E36,IF(C$1=\"I\",F36,IF(C$1=\"E\",G36,D36)))","v":"Relevé de situation V37"},"Situationserfassung V37","Relevé de situation V37","Analisi domanda di calore V37","Demand assessment V37"]
[1,"B41","Format de fichier: .xlsm","Dateiformat: .xlsm","Format de fichier: .xlsm","Formato del file: .xlsm","File format: .xlsm"]
[1,"A28","Données caractéristiques calculées","Berechnete Kennzahlen","Données caractéristiques calculées","Indicatori calcolati","Calculated key figures"]
[1,"A30","Chaleur ambiante","Raumwärme","Chaleur ambiante","Calore dell'ambiente","Space heating"]
[1,"B30","Heures de marche à pleine charge chaleur ambiante [h/a]","Vollbetriebsstundenzahl Raumwärme [h/a]","Heures de marche à pleine charge chaleur ambiante [h/a]","Ore di funzionamento a pieno carico per il riscaldamento degli ambienti [h/a]","Full load operating hours for space heating [h/a]"]
[1,"B31","Besoin de chaleur spécifique [kWh/m²a]","Spezifischer Heizwärmebedarf [kWh/m²a]","Besoin de chaleur spécifique [kWh/m²a]","Domanda specifica del calore per il riscaldamento degli ambienti [kWh/m²a]","Specific heat demand for space heating [kWh/m²a]"]
[1,"B32","Puissance thermique spécifique requise [W/m²]","Spezifischer Wärmeleistungsbedarf [W/m²]","Puissance thermique spécifique requise [W/m²]","Domanda specifica della potenza per il ricaldamento degli ambienti [W/m²]","Specific heat capacity for space heating [W/m²]"]
[1,"A33","Eau chaude","Warmwasser","Eau chaude","Acqua calda sanitaria","Domestic hot water"]
[1,"B33","Heures de marche à pleine charge eau chaude [h/a]","Vollbetriebsstundenzahl Warmwasser [h/a]","Heures de marche à pleine charge eau chaude [h/a]","Ore di funzionamento a pieno carico per l'acqua calda sanitaria [h/a]","Full load operating hours domestic hot water [h/a]"]
[1,"B34","Besoin d'énergie spécifique eau chaude [kWh/m²a]","Spezifischer Energiebedarf Warmwasser [kWh/m²a]","Besoin d'énergie spécifique eau chaude [kWh/m²a]","Domanda specifica energetica per l'acqua calda sanitaria [kWh/m²a]","Specific energy demand for domestic hot water [kWh/m²a]"]
[1,"A35","Chaleur industrielle","Prozesswärme","Chaleur industrielle","Calore di processo","Process heat"]
[1,"B35","Heures de marche à pleine charge chaleur industrielle [h/a]","Vollbetriebsstundenzahl Prozesswärme [h/a]","Heures de marche à pleine charge chaleur industrielle [h/a]","Ore di funzionamento a pieno carico per il calore di processo [h/a]","Full load operating hours for process heat [h/a]"]
[1,null," "," "," "]
[1,"A37","* Le besoin de chaleur annuel pour 365 jours doit être indiqué","* Es ist der Jahreswärmebedarf für 365 Tage einzugeben ","* Le besoin de chaleur annuel pour 365 jours doit être indiqué","* richiesta di calore annuale per 365 giorni","* annual heat demand for 365 days"]
[1,"A38","(besoin de chaleur hiver = besoin de chaleur annuel x jours chauffées / 365 jours)","(Winter-Wärmebedarf = Jahreswärmebedarf x Heiztage / 365 Tage)","(besoin de chaleur hiver = besoin de chaleur annuel x jours chauffées / 365 jours)","(richiesta di calore in inverno = richiesta di calore annuale x giorni di riscaldamento / 365 giorni)","(heat demand in winter = annual heat demand x heating days / 365 days)"]
[1,null," "," "," "]
[1,"A40","Champs a remplir","Eingabefelder","Champs a remplir","Campi da compilare","Input fields"]
[null,null," "," "," "]
[2,"A8","Données planificateur principale","Eingaben Hauptplaner","Données planificateur principale","Inputs del progettista principale","Inputs main planner"]
[2,"A10","Généralités","Allgemeines","Généralités","Informazioni generali","General information"]
[2,"B10","Pays","Land","Pays","Paese","Country"]
[2,"B11","Station climatologique","Klimastation","Station climatologique","Stazione climatica","Climate station"]
[2,"B12","Température extérieure plus basse [°C]","Tiefste Aussentemperatur [°C]","Température extérieure plus basse [°C]","Temperatura esterna più bassa [°C]","Lowest outdoor temperature [°C]"]
[2,"E12",{"$f":"IF(C$1=\"F\",E59,IF(C$1=\"I\",F59,IF(C$1=\"E\",G59,D59)))","v":"°C = valeur moyenne 10 ans (1993 - 2002)"},"°C = 10-Jahres-Mittelwert (1993 - 2002)","°C = valeur moyenne 10 ans (1993 - 2002)","°C = media su 10 anni (1993 - 2002)","°C = 10-year average (1993 - 2002)"]
[2,"E12","°C = valeur moyenne 10 ans (2011 - 2020)","°C = 10-Jahres-Mittelwert (2011 - 2020)","°C = valeur moyenne 10 ans (2011 - 2020)","°C = media su 10 anni (2011 - 2020)","°C = 10-year average (2011 - 2020)"]
[2,"E12","°C = valeur moyenne 10 ans (2002 - 2011)","°C = 10-Jahres-Mittelwert (2002 - 2011)","°C = valeur moyenne 10 ans (2002 - 2011)","°C = media su 10 anni (2002 - 2011)","°C = 10-year average (2002 - 2011)"]
[2,"B13","Température ambiante [°C]","Raumtemperatur [°C]","Température ambiante [°C]","Temperatura ambiente [°C]","Room temperature [°C]"]
[2,"B14","Limite de chauffage [°C]","Heizgrenze [°C]","Limite de chauffage [°C]","Limite di riscaldamento [°C]","Heating limit [°C]"]
[2,"B15","Température aller principale max. [°C]","Max. Haupt-Vorlauftemperatur [°C]","Température aller principale max. [°C]","Max. Temperatura di mandata principale [°C]","Max. main supply temperature [°C]"]
[2,"B16","Exploitation estivale","Sommerbetrieb","Exploitation estivale","Funzinamento estivo","Summer operation"]
[2,"A17","Chaleur ambiante","Raumwärme","Chaleur ambiante","Calore ambienti","Space heating"]
[2,"B17","Part de la puissance thermique requise chaleur ambiante non dépendante de la température extérieure [%]","Nicht witterungsabhängiger Anteil Wärmeleistungsbedarf Raumwärme [%]","Part de la puissance thermique requise chaleur ambiante non dépendante de la température extérieure [%]","Quota non dipendente dalle condizioni climatiche della richiesta di calore per il riscaldamento degli ambienti [%].","Non-weather-dependent share of heat capacity for space heating [%]"]
[2,"B18","Facteur de simultanéité chaleur ambiante [-]","Gleichzeitigkeitsfaktor Raumwärme [-]","Facteur de simultanéité chaleur ambiante [-]","Fattore di simultaneità per il calore ambienti [-]","Simultaneity factor space heating [-]"]
[2,"A19","Eau chaude","Warmwasser","Eau chaude","Acqua calda sanitaria","Domestic hot water"]
[2,"B19","Facteur de simultanéité eau chaude [-]","Gleichzeitigkeitsfaktor Warmwasser [-]","Facteur de simultanéité eau chaude [-]","Fattore di simultaneità per l'acqua calda [-]","Simultaneity factor domestic hot water [-]"]
[2,"A20","Chaleur industrielle","Prozesswärme","Chaleur industrielle","Calore di processo","Process heat"]
[2,"B20","Facteur de simultanéité chaleur industrielle [-]","Gleichzeitigkeitsfaktor Prozesswärme [-]","Facteur de simultanéité chaleur industrielle [-]","Fattore di simultaneità per il calore di processo [-]","Simultaneity factor process heat [-]"]
[2,"A21","Conduite à distance","Fernleitung","Conduite à distance","Rete di teleriscaldamento","District heating network"]
[2,"B21","Perte de chaleur annuelle conduite à distance [MWh/a]","Jahres-Wärmeverlust Fernleitung [MWh/a]","Perte de chaleur annuelle conduite à distance [MWh/a]","Perdita annuale di calore della rete di teleriscaldamento [MWh/a]","Annual heat losses district heating network [MWh/a]"]
[2,"B22","Perte de puissance conduite à distance [kW]","Verlustleistung Fernleitung [kW]","Perte de puissance conduite à distance [kW]","Perdita di potenza della rete di teleriscaldamento [kW]","Heat loss capacity of the district heating network [kW]"]
[2,null,{"$f":"IF(C$1=\"F\",E76,IF(C$1=\"I\",F76,IF(C$1=\"E\",G76,D76)))","v":" "}," "," "]
[2,"A24","Valeurs cumulées calculées","Berechnete Summenwerte","Valeurs cumulées calculées","Calcolo dei valori totali","Calculated total values"]
[2,"A26","Généralités","Allgemeines","Généralités","Informazioni generali","General information"]
[2,"B26","Surface de référence énergétique totale [m²]","Gesamt-Energiebezugsfläche [m²]","Surface de référence énergétique totale [m²]","Superficie disperdente totale [m²]","Total energy reference area [m²]"]
[2,"A27","Chaleur ambiante","Raumwärme","Chaleur ambiante","Calore dell'ambiente","Space heating"]
[2,"B27","Besoin de chaleur total [MWh/a]","Gesamt-Heizwärmebdarf [MWh/a]","Besoin de chaleur total [MWh/a]","Richiesta di calore totale per il riscaldamento degli ambienti [MWh/a]","Total heat demand for space heating [MWh/a]"]
[2,"B28","Puissance thermique totale requise chaleur ambiante max. [kW]","Max. Gesamt-Wärmeleistungsbedarf Raumwärme [kW]","Puissance thermique totale requise chaleur ambiante max. [kW]","Max. potenza termica totale per il riscaldamento degli ambienti  [kW]","Total max. heat capacity for space heating [kW]"]
[2,"A29","Eau chaude","Warmwasser","Eau chaude","Acqua calda sanitaria","Domestic hot water"]
[2,"B29","Besoin de chaleur annuel total eau chaude [MWh/a]","Gesamt-Jahreswärmebdarf Warmwasser [MWh/a]","Besoin de chaleur annuel total eau chaude [MWh/a]","Domanda di calore totale annua per acqua calda sanitaria [MWh/a].","Total annual heat demand for domestic hot water [MWh/a]"]
[2,"B30","Puissance thermique totale requise eau chaude max. [kW]","Max. Gesamt-Wärmeleistungsbedarf Warmwasser [kW]","Puissance thermique totale requise eau chaude max. [kW]","Domanda max. di calore totale annua per acqua calda sanitaria [MWh/a].","Total max. heat capacity for domestic hot water [kW]"]
[2,"A31","Chaleur industrielle","Prozesswärme","Chaleur industrielle","Calore di processo","Process heat"]
[2,"B31","Besoin de chaleur annuel total chaleur industrielle [MWh/a]","Gesamt-Jahreswärmebdarf Prozesswärme [MWh/a]","Besoin de chaleur annuel total chaleur industrielle [MWh/a]","Domanda di calore totale annua per il calore di processo [MWh/a].","Total annual heat demand for process heat [MWh/a]"]
[2,"B32","Puissance thermique totale requise chaleur industrielle max. [kW]","Max. Gesamt-Wärmeleistungsbedarf Prozesswärme [kW]","Puissance thermique totale requise chaleur industrielle max. [kW]","Max. domanda di calore totale annua per il calore di processo [MWh/a].","Total max. heat capacity for process heat [kW]"]
[2,"A33","∑ des consommateurs","∑ Wärmeabnehmer","∑ des consommateurs","∑ consumatori di calore","∑ heat consumers"]
[2,"B33","Besoin de chaleur globale [MWh/a]","Gesamt-Wärmebedarf [MWh/a]","Besoin de chaleur globale [MWh/a]","Domanda di calore totale [MWh/a].","Total heat demand [MWh/a]"]
[2,"B34","Puissance thermique à installer globale [kW]","Gesamt-Wärmeleistungbedarf [kW]","Puissance thermique à installer globale [kW]","Domanda di potenza di calore totale  [MWh/a].","Total heat capacity [kW]"]
[2,null," "," "," "]
[2,"A36","Données caractéristiques calculées","Berechnete Kennzahlen","Données caractéristiques calculées","Indicatori calcolati","Calculated key figures"]
[2,"A38","Généralités","Allgemeines","Généralités","Informazioni generali","General information"]
[2,"B38","Température aller consommateurs max. [°C]","Max. Vorlauftemperatur Wärmeabnehmer [°C]","Température aller consommateurs max. [°C]","Max. Temperatura di mandata per il consumatore di calore [°C]","Max. supply temperature heat consumer [°C]"]
[2,"B39","Température retour principale max. [°C]","Max. Hauptrücklauftemperatur [°C]","Température retour principale max. [°C]","Max. Temperatura di ritorno di consumatore di calore [°C]","Max. main return temperature [°C]"]
[2,"A40","Chaleur ambiante","Raumwärme","Chaleur ambiante","Calore dell'ambiente","Space heating"]
[2,"B40","Heures de marche à pleine charge chaleur ambiante [h/a]","Vollbetriebsstundenzahl Raumwärme [h/a]","Heures de marche à pleine charge chaleur ambiante [h/a]","Ore di funzionamento a pieno carico per il riscaldamento degli ambienti [h/a]","Full load operating hours for space heating [h/a]"]
[2,"B41","Besoin de chaleur spécifique [kWh/m²a]","Spezifischer Heizwärmebedarf [kWh/m²a]","Besoin de chaleur spécifique [kWh/m²a]","Domanda specifica di calore per il riscaldamento degli ambienti [kWh/m²a]","Specific heat demand for space heating [kWh/m²a]"]
[2,"B42","Puissance thermique spécifique requise [W/m²]","Spezifischer Wärmeleistungsbedarf [W/m²]","Puissance thermique spécifique requise [W/m²]","Domanda specifica della potenza per il ricaldamento degli ambienti [W/m²]","Specific heat capacity for space heating [W/m²]"]
[2,"A43","Eau chaude","Warmwasser","Eau chaude","Acqua calda sanitaria","Domestic hot water"]
[2,"B43","Heures de marche à pleine charge eau chaude [h/a]","Vollbetriebsstundenzahl Warmwasser [h/a]","Heures de marche à pleine charge eau chaude [h/a]","Ore di funzionamento a pieno carico per l'acqua calda sanitaria [h/a]","Full load operating hours domestic hot water [h/a]"]
[2,"B44","Besoin d'énergie spécifique eau chaude [kWh/m²a]","Spezifischer Energiebedarf Warmwasser [kWh/m²a]","Besoin d'énergie spécifique eau chaude [kWh/m²a]","Domanda specifica di calore per l'acqua calda sanitaria [kWh/m²a]","Specific energy demand for domestic hot water [kWh/m²a]"]
[2,"A44","Chaleur industrielle","Prozesswärme","Chaleur industrielle","Calore di processo","Process heat"]
[2,"B45","Heures de marche à pleine charge chaleur industrielle [h/a]","Vollbetriebsstundenzahl Prozesswärme [h/a]","Heures de marche à pleine charge chaleur industrielle [h/a]","Ore di funzionamento a pieno carico per il calore di processo [h/a]","Full load operating hours for process heat [h/a]"]
[null,null," "," "," "]
["Hilfs","S3","oui","Ja","oui","Si","Yes"]
["Hilfs","S4","non","Nein","non","No","No"]
["Hilfs","U3","Franc Suisse","Franken","Franc Suisse","Franchi svizzeri","Swiss franc"]
["Hilfs","U4","Euro","Euro","Euro","Euro","Euro"]
["Hilfs","V3","Plaquettes de bois","Holzhackschnitzel","Plaquettes de bois","Cippato","Wood chips"]
["Hilfs","V4","Granulé","Pellets","Granulé","Pellets","Pellets"]
[null,null," "," "," "]
[1,"C11","Bâtiment ancien","Altbau","Bâtiment ancien","Vecchio edificio","Old building"]
[1,"C14","Livraison de mazout","Öl-Lieferung","Livraison de mazout","Consegna del gasolio","Oil delivery"]
[1,"F11","Nouveau bâtiment","Neubau","Nouveau bâtiment","Nuova costruzione","New building"]
[1,"F14","Norme SIA ","SIA-Norm","Norme SIA ","Norme SIA","SIA standard"]
[1,null," "," "," "]
[1,"D11","Ecole existente","Altes Schulhaus","Ecole existente","Vecchia scuola","Old school building"]
[1,"D14","Décompte","Abrechnung","Décompte","Contabilità","Accounting"]
[1,null," "," "," "]
[1,"E11","Chaleur industrielle","Prozess","Chaleur industrielle","Processo","Process"]
[1,"E14","Mesure","Messung","Mesure","Misurazione","Measurement"]
[null,null,0]
["Q-Plan","A2","    Unité monétaire:                                   Combustible:","    Währungseinheit:                                      Brennstoff:","    Unité monétaire:                                   Combustible:","      Unità monetaria:                                 Combustibile:","         Currency unit:                                          Fuel:"]
["Q-Plan",null,"Tableau Excel «Plan QM»","Excel-Tabelle «Q-Plan»","Tableau Excel «Plan QM»","Tabella Excel \"Q-piano\"","Excel table \"Q-plan\""]
["Q-Plan",null,"Nom du projet ou projet No","Projekt-Kurzbezeichnung oder Projekt-Nr.","Nom du projet ou projet No","Sigla del progetto o numero del progetto","Project short name or project no."]
["Q-Plan",null,"Planification","Planung","Planification","Proggetazione","Plan"]
["Q-Plan",null,"État réel EP5","Ist, MS 5","État réel EP5","È, MS 5","Is, MS5"]
["Q-Plan",null,"Bilan énergétique de tous leur preneurs de chaleur","Wärmebedarf aller Wärmeabnehmer","Bilan énergétique de tous leur preneurs de chaleur","Domanda di calore di tutti i consumatori","Heat demand of all heat consumers"]
["Q-Plan",null,"          dont ceux raccordés au réseau","          davon über das Wärmenetz","          dont ceux raccordés au réseau","          di cui tramite la rete di teleriscaldamento","          of which via the heating network"]
["Q-Plan",null,"Pertes thermiques du réseau de chaleur","Wärmeverluste  Wärmenetz","Pertes thermiques du réseau de chaleur","Perdite di calore della rete di teleriscaldamento","District heating network losses"]
["Q-Plan",null,"Bilan énergétique global (y compris pertes du réseau de chaleur)","Gesamtwärmebedarf  (inkl. Verluste Wärmenetz)","Bilan énergétique global (y compris pertes du réseau de chaleur)","Domanda totale di calore (incluse le perdite della rete di teleriscaldamento)","Total heat demand (incl. district heating network losses)"]
["Q-Plan",null,"Puissance thermique de tous les preneurs de chaleur","Wärmeleistungsbedarf  aller Wärmeabnehmer","Puissance thermique de tous les preneurs de chaleur","Domanda di potenza per il calore di tutti i consumatori","Heat capacity of all heat consumers"]
["Q-Plan",null,"          dont ceux raccordés au réseau","          davon über das Wärmenetz","          dont ceux raccordés au réseau","          di cui tramite la rete di teleriscaldamento","          of which via the heating network"]
["Q-Plan",null,{"$f":"IF(C$1=\"F\",E136,IF(C$1=\"I\",F136,IF(C$1=\"E\",G136,D136)))","v":"Pertes de puissance du réseau de chaleur"},"Wärmeleistungsverluste Wärmenetz","Pertes de puissance du réseau de chaleur","Perdite di potenza di calore nella rete di teleriscaldamento","Heat losses district heating network "]
["Q-Plan",null,"Puissance thermique globale de la production de chaleur","Gesamt-Wärmeleistungsbedarf Wärmeerzeugung","Puissance thermique globale de la production de chaleur","Richiesta di potenza di calore per la produzione di calore","Total heat capacity "]
["Q-Plan",null,"Longueur de fouilles du réseau de chaleur (y compris branchements d'immeubles)","Trassenlänge Wärmenetz  (inkl. Hausanschlüsse)","Longueur de fouilles du réseau de chaleur (y compris branchements d'immeubles)","Lunghezza della rete di teleriscaldamento (compresi gli allacciamenti della casa)","Length of district heating network (incl. house connections) "]
["Q-Plan",null,"Puissance nominale de la (des) chaudière(s) à bois avec combustible de référence","Nennleistung der/des  Holzkessel(s) mit Referenzbrennstoff","Puissance nominale de la (des) chaudière(s) à bois avec combustible de référence","Potenza nominale della caldaia a legna con un combustibile di riferimento","Nominal heat capacity of the biomass boiler(s) with reference fuel"]
["Q-Plan",null,"Puissance nominale de la production de chaleur avec d'autres vecteurs énergétiques…......","Nennleistung der Wärmeerzeugung mit anderen Energieträgern:  .......................................                                                                                    ","Puissance nominale de la production de chaleur avec d'autres vecteurs énergétiques…......","Potenza nominale della produzione di calore con altre fonti di energia:  .......................................                                                                                     ","Nominal heat capacity of the heat production with other energy sources: ……………"]
["Q-Plan",null,"Total puissance nominale de la production de chaleur","Nennleistung der Wärmeerzeugung total","Total puissance nominale de la production de chaleur","Potenza nominale totale della produzione di calore","Total nominal heat capacity of heat production"]
["Q-Plan",null,"Part de l'énergie produite avec du bois","Anteil der mit Holzenergie produzierte Wärmemenge","Part de l'énergie produite avec du bois","Quota di calore prodotto con la legna","Percentage of heat produced from biomass "]
["Q-Plan",null,"Énergie produite avec du bois","Mit Holzenergie produzierte Wärmemenge","Énergie produite avec du bois","Calore prodotto usando legna","Heat produced from biomass"]
["Q-Plan",null,"Volume net du silo","Silogrösse netto","Volume net du silo","Grandezza netta del serbatoio legna","Net size of the storage silo"]
["Q-Plan",null,"Taux de remplissage du silo","Füllgrad Silo","Taux de remplissage du silo","Livello di riempimento del serbatoio legna","Filling level of the storage silo"]
["Q-Plan",null,"Volume brut du silo","Silogrösse brutto","Volume brut du silo","Grandezza lordo del serbatoio legna","Gross size of the storage silo"]
["Q-Plan",null,"Pouvoir calorifique par mètre cube de plaquettes","Energie-Inhalt pro Schüttraummeter (Holzhackschnitzel)","Pouvoir calorifique par mètre cube de plaquettes","Contenuto energetico per metro cubo (cippato)","Energy content per cubic meter (wood chips)"]
["Q-Plan",null,"Pouvoir calorifique par kilogramme de granulé","Energie-Inhalt pro Kilogramm (Pellets)","Pouvoir calorifique par kilogramme de granulé","Contenuto energetico per chilo (pellet)","Energy content per kilogram (pellets)"]
["Q-Plan",null,"Consommation annuelle de combustible","Jährlicher Brennstoffverbrauch der/des Holzkessel(s) ","Consommation annuelle de combustible","Consumo annuo del combustibile della caldaia a legna ","Annual fuel consumption of the biomass boiler(s)"]
["Q-Plan",null,"Coûts","Kosten","Coûts","Costi","Costs"]
["Q-Plan",null,"Coûts d'investissements pour la production de chaleur","Investitionskosten  Wärmeerzeugung ","Coûts d'investissements pour la production de chaleur","Costi di investimento per la produzione di calore","Investment costs of heat production"]
["Q-Plan",null,"Coûts d'investissements pour le réseau de chaleur","Investitionskosten  Wärmenetz ","Coûts d'investissements pour le réseau de chaleur","Costi di investimento per la rete di teleriscaldamento","Investment costs of heating network"]
["Q-Plan",null,"Données de température au point de dimensionnement","Temperaturangaben im Auslegungspunkt","Données de température au point de dimensionnement","Dati di temperatura di progetto","Temperature specification in the design point"]
["Q-Plan",null,"Température départ principal réseau à distance au point de mesure","Temperatur Hauptvorlauf Fernleitung","Température départ principal réseau à distance au point de mesure","Temperatura di mandata principale della rete di teleriscaldamento","Temperature of the main supply pipe"]
["Q-Plan",null,"Température retour principal réseau à distance au point de mesure","Temperatur Hauptrücklauf Fernleitung ","Température retour principal réseau à distance au point de mesure","Temperatura di ritorno principale della rete di teleriscaldamento","Temperature of the main return pipe"]
["Q-Plan",null,"Caractéristiques","Kennzahlen","Caractéristiques","Indici","Key figures"]
["Q-Plan",null,"convenue","Vereinbarung","convenue","Accordo","Agreed value"]
["Q-Plan",null,"resp. valeur","bzw. Zielwert","resp. valeur","o obiettivo"]
["Q-Plan",null,"E.2.6 Nombre d'heures de fonctionnement à pleine charge\ndes preneurs de chaleur","E.2.6 Vollbetriebsstundenzahl der Wärmeabnehmer","E.2.6 Nombre d'heures de fonctionnement à pleine charge\ndes preneurs de chaleur","E.2.6 Ore di funzinamento a pieno carico die consumatori di calore","E.2.6 Full load operating hours of the heat consumers"]
["Q-Plan",null,"E.3.3 Densité de raccordement du réseau de chaleur","E.3.3 Anschlussdichte Wärmenetz","E.3.3 Densité de raccordement du réseau de chaleur","E.3.3 Densità di calore lineare della rete di teleriscaldamento","E.3.3 Linear heat density"]
["Q-Plan",null,"E.3.3Pertes thermiques du réseau (% de la chaleur fournie)","E.3.3 Wärmeverluste Wärmenetz (% der zugeführten Wärme) ","E.3.3Pertes thermiques du réseau (% de la chaleur fournie)","E.3.3 Perdite di calore nella rete di teleriscaldamento (% del calore prodotto)","E.3.3 District heating network losses (% of the heat input into the network) "]
["Q-Plan",null,"         Coûts de la distribution de chaleur par mètre de fouille","         Wärmeverteilkosten pro Trm ","         Coûts de la distribution de chaleur par mètre de fouille","         Costi di distribuzione del calore per m (lunghezza rete di teleriscaldamento)","         Heat distribution costs per Trm"]
["Q-Plan",null,"E.3.3 Coûts d'investissements spécifiques du réseau de chaleur","E.3.3 Spezifische Investitionskosten Wärmenetz","E.3.3 Coûts d'investissements spécifiques du réseau de chaleur","E.3.3 Costi di investimento specifici per la rete di teleriscaldamento","E.3.3 Specific investment costs of heating network"]
["Q-Plan",null,"E.4.10 Coûts d'investissements spécifiques de la production de chaleur","E.4.10 Spezifische Investitionskosten Wärmeerzeugung","E.4.10 Coûts d'investissements spécifiques de la production de chaleur","E.4.10 Costi di investimento specifici per la produzione di calore","E.4.10 Specific investment costs of heat production"]
["Q-Plan",null,"E.4.4 Nombre d'heures de fonctionnement à pleine charge\nde la (des) chaudière(s) à bois","E.4.4 Vollbetriebsstundenzahl der/des Holzkessel(s) ","E.4.4 Nombre d'heures de fonctionnement à pleine charge\nde la (des) chaudière(s) à bois","E.4.4 Ore di funzionamento a pieno carico della caldaia a legna","E.4.4 Total full load operating hours of the biomass boiler(s)"]
["Q-Plan",null,"E.4.6 Nombre d'heures de fonctionnement à pleine charge d'autres \nproducteurs de chaleur","E.4.6 Vollbetriebsstundenzahl andere Wärmeerzeuger","E.4.6 Nombre d'heures de fonctionnement à pleine charge d'autres \nproducteurs de chaleur","E.4.6 Ore di funzionamento a pieno carico di altri generatori di calore","E 4.6 Total full load operating hours of other heat production units"]
["Q-Plan",null,"E.4.5 Volume du silo: Couverture des besoins à pleine charge en nombre de jours (+30 m3pl)","E.4.5 Silogrösse: Abdeckung des Vollastbedarfs in Anzahl Tage (+30Srm)","E.4.5 Volume du silo: Couverture des besoins à pleine charge en nombre de jours (+30 m3pl)","E.4.5 Volume del serbatio della legna: Coprire la domanda a pieno carico in numero di giorni (+30 metri steri rinfusi)","E.4.5 Storage size: Coverage the full load demand in number of days (+ 30 LCM)"]
["Q-Plan",null,"E.4.5 Volume du silo: Couverture des besoins à pleine charge en nombre de jours","E.4.5 Silogrösse: Abdeckung des Vollastbedarfs in Anzahl Tage","E.4.5 Volume du silo: Couverture des besoins à pleine charge en nombre de jours","E.4.5 Grandezza del serbatio della legna: Coprire la domanda a pieno carico in numero di giorni","E.4.5 Storage size: Coverage the full load demand in number of days"]
["Q-Plan",null,"Les champs grisés doivent être remplis","Die grau hinterlegten Felder sind Eingabefelder","Les champs grisés doivent être remplis","I campi a sfondo grigio sono campi di input","The fields with a grey background are input fields"]
["Q-Plan",null,"Jours","Tage","Jours","Giorni","days"]
["Q-Plan",null,"kWh/m3pl","kWh/Srm","kWh/m3pl","kWh/msr","kWh/LCM"]
["Q-Plan",null,"m3pl","Srm","m3pl","msr","LCM"]
["Q-Plan",null,"mF","Trm","mF","m","m"]
["Q-Plan",null,"MWh/(a mF)","MWh/(a Trm)","MWh/(a mF)","MWh/m","MWh/(a m)"]
["Q-Plan",null,"CHF/mF","CHF/Trm","CHF/mF","CHF/m","CHF/m"]
["Q-Plan",null,"€/mF","€/Trm","€/mF","€/m","€/m"]
["Q-Plan",null,"Prédéfinition de la monnaie et le type de carburant","Vordefinition von Währung und Brennstofftyp","Prédéfinition de la monnaie et le type de carburant","Predefinizione della valuta e del tipo di carburante","Predefinition of currency and fuel type"]
["Q-Plan",null,"Calcul basé ou un exemple de valeur d'entrée dans la colonne \"Planification\":","Berechnungs-Basis oder Beispiel für Eingabewert in Spalte \"Planung\":","Calcul basé ou un exemple de valeur d'entrée dans la colonne \"Planification\":","Base di calcolo o esempio per il valore di ingresso nella colonna \" Progettazione\":","Calculation basis or example for input value in column \"Plan\":"]
["Q-Plan",null,"Texte de la cellule B3 'Consommateurs'","Übernahme aus 'Verbraucher_Consommateurs' Zelle B3","Texte de la cellule B3 'Consommateurs'","Testo dalla cella B3 'Consumatore'","Transfer from sheet 'Consumers' cell B3"]
["Q-Plan",null,"Valeur de la planification de la feuille Excel 'Hilfsblatt'","Planungswert von 'Hilfsblatt'","Valeur de la planification de la feuille Excel 'Hilfsblatt'","Valore della progettazione del file Excel 'Hilfsblatt'","Planning value from sheet 'Hilfsblatt'"]
["Q-Plan",null,"Valeur d'entrée; entrée possible de Formule","Eingabewert; Formeleingabe möglich","Valeur d'entrée; entrée possible de Formule","Valore d'ingresso; possibilità di inserire la formula","Input value; formula input possible"]
["Q-Plan",null,"Valeur de la planification de la feuille Excel 'Hilfsblatt'","Planungswert von 'Hilfsblatt'","Valeur de la planification de la feuille Excel 'Hilfsblatt'","Valore di progettazione del file Excel 'Hilfsblatt'","Planning value from sheet 'Hilfsblatt'"]
["Q-Plan",null,"Valeur calculée:","Berechneter Wert:","Valeur calculée:","Valore calcolato:","Calculated value:"]
["Q-Plan",null,"Valeur de la planification de la feuille Excel 'Informations generales'","Planungswert von 'Anlage_Installation'","Valeur de la planification de la feuille Excel 'Informations generales'","Valore di progettazione del file Excel 'Informazioni generali'","Planning value from sheet 'General information'"]
["Q-Plan",null,"valeur sélectionnable; entrée possible de Formule","Frei einzugebender Wert; Formeleingabe möglich","valeur sélectionnable; entrée possible de Formule","Valore selezionabile; possibilità di inserire una formula","Value to be entered freely; formula input possible"]
["Q-Plan",null,"Valeur de la planification de la feuille Excel 'Informations generales'","Planungswert von 'Anlage_Installation'","Valeur de la planification de la feuille Excel 'Informations generales'","Valore della progettazione del file Excel 'Informazioni generali'","Planning value from sheet 'General information'"]
["Q-Plan",null,"Valeur d'entrée; entrée possible de Formule","Eingabewert; Formeleingabe möglich","Valeur d'entrée; entrée possible de Formule","Valore di ingresso; possibilità di inserire una formula","Input value; formula input possible"]
["Q-Plan",null,"Valeur de la planification de la feuille Excel 'CentralThermique'","Planungswert von 'Wärmezentrale_Chauffage'","Valeur de la planification de la feuille Excel 'CentralThermique'","Valore della progettazione del file Excel 'Impianto di riscaldimento'.","Planning value from sheet 'Heating plant'"]
["Q-Plan",null,"Valeur de la planification de la feuille Excel 'CentralThermique'","Planungswert von 'Wärmezentrale_Chauffage'","Valeur de la planification de la feuille Excel 'CentralThermique'","Valore della progettazione del file Excel 'Impianto di riscaldimento'.","Planning value from sheet 'Heating plant'"]
["Q-Plan",null,"valeur de la planification de la Çfeuille auxiliaireÈ","Planungswert von 'Hilfsblatt'","valeur de la planification de la Çfeuille auxiliaireÈ","Valore della progettazione del file Excel 'Hilfsblatt'","Planning value from sheet 'Hilfsblatt'"]
["Q-Plan",null,"Valeur d'entrée; entrée possible de Formule","Eingabewert; Formeleingabe möglich","Valeur d'entrée; entrée possible de Formule","Valore di ingresso; possibilità di inserire una formula","Input value; formula input possible"]
["Q-Plan",null,"Valeur d'entrée; entrée possible de Formule","Eingabewert; Formeleingabe möglich","Valeur d'entrée; entrée possible de Formule","Valore di ingresso; possibilità di inserire una formula","Input value; formula input possible"]
["Q-Plan",null,"Valeur d'entrée; entrée possible de Formule","Eingabewert; Formeleingabe möglich","Valeur d'entrée; entrée possible de Formule","Valore di ingresso; possibilità di inserire una formula","Input value; formula input possible"]
["Q-Plan",null,"Valeur d'entrée; entrée possible de Formule","Eingabewert; Formeleingabe möglich","Valeur d'entrée; entrée possible de Formule","Valore di ingresso; possibilità di inserire una formula","Input value; formula input possible"]
["Q-Plan",null,"Valeur d'entrée; entrée possible de Formule","Eingabewert; Formeleingabe möglich","Valeur d'entrée; entrée possible de Formule","Valore di ingresso; possibilità di inserire una formula","Input value; formula input possible"]
["Q-Plan",null,"Valeur d'entrée; entrée possible de Formule","Eingabewert; Formeleingabe möglich","Valeur d'entrée; entrée possible de Formule","Valore di ingresso; possibilità di inserire una formula","Input value; formula input possible"]
["Q-Plan",null,"Valeur d'entrée; entrée possible de Formule","Eingabewert; Formeleingabe möglich","Valeur d'entrée; entrée possible de Formule","Valore di ingresso; possibilità di inserire una formula","Input value; formula input possible"]
["Q-Plan",null,"; bois d'efficacité annuel chaudiéres 85%","; Jahrenutzungsgrad Holzkessel 85%","; bois d'efficacité annuel chaudiéres 85%","; rendimento annuale della caldaia a legna a 85%","; annual efficiency biomass boiler 85%"]
[null,null,0]
["WE",null,{"$f":"IF(C$1=\"F\",E200,IF(C$1=\"I\",F200,IF(C$1=\"E\",G200,D200)))","v":"Données planificateur principale"},"Eingaben Hauptplaner","Données planificateur principale","Inputs del progettista principale","Inputs main planner"]
["WE",null,"Données caractéristiques calculées","Berechnete Kennzahlen","Données caractéristiques calculées","Indicatori calcolati","Calculated key figures"]
["WE",null,"Champs a remplir","Eingabefelder","Champs a remplir","Campi da compilare","Input fields"]
["WE",null,"Formats de fichiers recommandés: .xlsm oder .xls (Excel 97-2004)","Empfohlene Dateiformate: .xlsm oder .xls (Excel 97-2004)","Formats de fichiers recommandés: .xlsm oder .xls (Excel 97-2004)","Formati di file consigliati: .xlsm o .xls (Excel 97-2004)","Recommended file formats: .xlsm or .xls (Excel 97-2004)"]
["WE",null,"Aucun","Keine","Aucun","n/a","n/a"]
["WE",null,"Centrale de chauffage","Wärmezentrale","Centrale de chauffage","Impianto di riscaldamento","Heating plant"]
["WE",null,"Solution Standard de QM","Standard-Schaltung nach QMH","Solution Standard de QM","Schemi standard secondo QM","Standard hydraulic scheme according to QM"]
["WE",null,"Puissance nominale chaudière à bois 1 (petit chaudière WE1 – WE8) [kW]","Nennleistung Holzkessel 1 (kl. Kessel bei WE1 – WE8) [kW]","Puissance nominale chaudière à bois 1 (petit chaudière WE1 – WE8) [kW]","Potenza nominale della caldaia a legna 1 (piccola caldaia per WE1 - WE8) [kW].","Nominal heat capacity biomass boiler 1 (small boiler in WE1 - WE8) [kW]"]
["WE",null,"Puissance nominale chaudière à bois 2 (grande chaudière WE1 – WE8) [kW]","Nennleistung Holzkessel 2 (gr. Kessel bei WE5 – WE8) [kW]","Puissance nominale chaudière à bois 2 (grande chaudière WE1 – WE8) [kW]","Potenza nominale della caldaia a legna 2 (grande caldaia per WE5 - WE8) [kW].","Nominal h output biomass boiler 2 (big boiler in WE5 - WE8) [kW]"]
["WE",null,"Puissance nominale plus chaudière à bois totale [kW]","Nennleistung weitere Holzkessel Total [kW]","Puissance nominale plus chaudière à bois totale [kW]","Potenza nominale di altre caldaie a legna totale [kW].","Total nominal heat output additional boiler(s) [kW]"]
["WE",null,"Nombre de chaudière à bois installé dans les systèmes à plusieurs chaudières à bois","Anzahl installierte Holzkessel bei mehr als zwei Holzkessel [–]","Nombre de chaudière à bois installé dans les systèmes à plusieurs chaudières à bois","Numero di caldaie a legna installate se ci sono più di due caldaie a legna [-].","Number of boilers installed if there are more than two [-]"]
["WE",null,"Puissance nominale chaudière à bois totale [kW]","Nennleistung Holzkessel Total [kW]","Puissance nominale chaudière à bois totale [kW]","Potenza nominale della caldaia a legna totale [kW]","Total nominal heat capacity biomass boilers [kW]"]
["WE",null,"Puissance chaudière mazout/gaz totale [kW]","Nennleistung Bivalenkessel Total (z.B. Öl, Gas) [kW]","Puissance chaudière mazout/gaz totale [kW]","Potenza nominale della caldaia bivalente Totale (ad es. gasolio, gas) [kW].","Total nominal heat capacity bivalent boiler(s) (e.g. oil, gas) [kW]"]
["WE",null,"Volume de l'accumulateur installée [m3]","Installiertes Speichervolumen [m3]","Volume de l'accumulateur installée [m3]","Volume dell'accumulo installato [m³]","Thermal storage capacity [m³]"]
["WE",null,"Le différentiel de température à travers l'accumulateur (départ – retour) [K]","Temperaturspreizung über dem Speicher (Vorlauf – Rücklauf) [K]","Le différentiel de température à travers l'accumulateur (départ – retour) [K]","Differenza della temperatura di mandata e di ritono nell'accumulo [K]","Temperature difference between supply and return at the storage [K]"]
["WE",null,"Moyenne de charge de chauffe journalière minimale en cas de fonctionnement à faible charge (voir tableau ci-dessous) [kW]","Minimale mittlere Tagesheizlast bei Schwachlastbetrieb (siehe Tabelle unten) [%]","Moyenne de charge de chauffe journalière minimale en cas de fonctionnement à faible charge (voir tableau ci-dessous) [kW]","Carico minimo medio giornaliero di riscaldamento con funzionamento a carico basso (vedi Tabella sotto) [%].","Minimum average daily heating load with low load operation (see Table below) [%]"]
["WE",null,"Performance journalière moyenne maximale de la chaudière à bois (valeur de 70% à 100%)","Maximale mittlere Holzkessel-Tagesleistung (Wert von 70% bis 100%)","Performance journalière moyenne maximale de la chaudière à bois (valeur de 70% à 100%)","Massima potenza media giornaliera della caldaia a legna (valore da 70% a 100%)","Maximum average daily heating load (value from 70% to 100%)"]
["WE",null,"Nombre d'heures de fonctionnement à pleine charge (chaudière à bois) [h/a]","Vollbetriebsstundenzahl der/des Holzkessel [h/a]","Nombre d'heures de fonctionnement à pleine charge (chaudière à bois) [h/a]","Ore di funzionamento a pieno carico della caldaia a legna [h/a]","Full load operating hours of the biomass boiler(s) [h/a]"]
["WE",null,"Nombre d'heures de fonctionnement à pleine charge (chaudière mazout/gaz) [h/a]","Vollbetriebsstundenzahl Bivalentkessel [h/a]","Nombre d'heures de fonctionnement à pleine charge (chaudière mazout/gaz) [h/a]","Ore di funzionamento a pieno carico delle caldaie bivalenti [h/a]","Full load operating hours bivalent boiler(s) [h/a]"]
["WE",null,"Production annuelle de chaleur avec du bois [%]","Jahreswärmeproduktion mit Holz [%]","Production annuelle de chaleur avec du bois [%]","Produzione annua del calore prodotto con la legna [%]","Annual heat production with biomass [%]"]
["WE",null,"Volume de l'accumulateur [m3]","Speichergrösse [m3]","Volume de l'accumulateur [m3]","Volume dell'accumulo [m³]","Thermal storage capacity [m³]"]
["WE",null,"Cas de fonctionnement à faible charge [kW]","Schwachlastbedingung [kW]","Cas de fonctionnement à faible charge [kW]","Condizioni a basso carico [kW]","Low load condition [kW]"]
["WE",null,"Dimensionnement de la puissance de la chaudière à bois","Auslegung Holzkessel","Dimensionnement de la puissance de la chaudière à bois","Progettazione della caldaia a legna","Design of biomass boiler capacity"]
["WE",null,"Dimensionnement de la puissance de la chaudière à bois 1","Auslegung Holzkessel 1","Dimensionnement de la puissance de la chaudière à bois 1","Progettazione della caldaia a legna 1","Design of biomass boiler capacity 1"]
["WE",null,"Dimensionnement de la puissance de la chaudière à bois 2","Auslegung Holzkessel 2","Dimensionnement de la puissance de la chaudière à bois 2","Progettazione della caldaia a legna 2","Design of biomass boiler capacity 2"]
["WE",null,"Totalement","Total","Totalement","Totale","Total"]
["WE",null,"Dimensionnement de la puissance de la chaudière mazout/gaz [kW]","Auslegung Bivalentkessel [kW]","Dimensionnement de la puissance de la chaudière mazout/gaz [kW]","Progettazione caldaia bivalente [kW]","Design bivalent boiler"]
["WE",null,"Résultat ≥ une valeur de comparaison","Ergebnis ≥ als Vergleichswert","Résultat ≥ une valeur de comparaison","Risultato ≥ del valore di confronto","Result ≥ reference value"]
["WE",null,"Résultat ≤ une valeur de comparaison (valeur cible)","Ergebnis ≤ als Vergleichswert (Zielwert)","Résultat ≤ une valeur de comparaison (valeur cible)","Risultato ≥ del valore di confronto (valore obiettivo)","Result ≤ reference value (target value)"]
["WE",null,"Résultat ≥ ou ≤ à la valeur comparative (zone cible)","Ergebnis ≥ oder ≤ als Vergleichswert (Zielbereich)","Résultat ≥ ou ≤ à la valeur comparative (zone cible)","Risultato ≥ o ≤ del valore di confronto (rispetto all'area target)","Result ≥ or ≤ reference value (target value)"]
["WE",null,"Résultat","Ergebnis","Résultat","Risultato","Result"]
["WE",null,"Valeur de comparaison","Vergleich","Valeur de comparaison","Confronto","Reference"]
["WE",null,"Sélectionnez Solution Standard de QM","Standard-Schaltung wählen","Sélectionnez Solution Standard de QM","Selezione dello schemo standard","Select standard hydraulic scheme"]
["WE",null,"par exemple Installation à plusieurs chaudières à bois","z.B. mehr als zwei Holzkessel","par exemple Installation à plusieurs chaudières à bois","ad esempio: più di due caldaie al legna","e.g. more than two biomass boilers"]
["WE",null,"Entrer la valeur","Wert eintragen","Entrer la valeur","Inserire il valore","enter value"]
["WE",null,"Ne pas entrer une valeur","kein Wert eintragen","Ne pas entrer une valeur","non inserire il valore","do not enter a value"]
["WE",null,"Sélectionnez une valeur dans le tableau (ci-dessous)","Wert aus Tabelle (unten) auswählen","Sélectionnez une valeur dans le tableau (ci-dessous)","Selezionare il valore dalla tabella (sotto)","Select value from Table (below)"]
["WE",null,"Entrez une valeur de 70% à 100%","Wert von 70% bis 100% eintragen","Entrez une valeur de 70% à 100%","Inserire il valore da 70% fino al 100% ","Enter a value from 70% to 100%"]
["WE",null,"WE1","WE1","WE1","WE1","WE1"]
["WE",null,"WE2","WE2","WE2","WE2","WE2"]
["WE",null,"WE3","WE3","WE3","WE3","WE3"]
["WE",null,"WE4","WE4","WE4","WE4","WE4"]
["WE",null,"WE5","WE5","WE5","WE5","WE5"]
["WE",null,"WE6","WE6","WE6","WE6","WE6"]
["WE",null,"WE7","WE7","WE7","WE7","WE7"]
["WE",null,"WE8","WE8","WE8","WE8","WE8"]
["WE",null,"1 chaudière à bois sans accumulateur","1 Holzkessel ohne Speicher","1 chaudière à bois sans accumulateur","1 caldaia a legna senza accumulo","1 biomass boiler without storage"]
["WE",null,"1 chaudière à bois avec accumulateur","1 Holzkessel mit Speicher","1 chaudière à bois avec accumulateur","1 caldaia a legna con accumulo","1 biomass boiler with storage"]
["WE",null,"1 chaudière à bois + 1 chaudière mazout/gaz sans accumulateur","1 Holzkessel + 1 Öl-/Gaskessel ohne Speicher","1 chaudière à bois + 1 chaudière mazout/gaz sans accumulateur","1 caldaia a legna + 1 caldaia a gasolio/gas senza accumulo","1 biomass boiler + 1 oil/gas boiler without storage"]
["WE",null,"1 chaudière à bois + 1 chaudière mazout/gaz avec accumulateur","1 Holzkessel + 1 Öl-/Gaskessel mit Speicher","1 chaudière à bois + 1 chaudière mazout/gaz avec accumulateur","1 caldaia a legna + 1 caldaia a gasolio/gas con accumulo","1 biomass boiler + 1 oil/gas boiler with storage"]
["WE",null,"2 chaudières à bois sans accumulateur","2 Holzkessel ohne Speicher","2 chaudières à bois sans accumulateur","2 caldaie a legna senza accumulo","2 biomass boilers without storage"]
["WE",null,"2 chaudières à bois avec accumulateur","2  Holzkessel mit Speicher","2 chaudières à bois avec accumulateur","2 caldaie a legna con accumulo","2 biomass boilers with storage"]
["WE",null,"2 chaudières à bois + 1 chaudière mazout/gaz sans accumulateur","2 Holzkessel + 1 Öl-/Gaskessel ohne Speicher","2 chaudières à bois + 1 chaudière mazout/gaz sans accumulateur","2 caldaie a legna + 1 caldaia a gasolio/gas senza accumulo","2 biomass boilers + 1 oil/gas boiler without storage"]
["WE",null,"2 chaudières à bois + 1 chaudière mazout/gaz avec accumulateur","2 Holzkessel + 1 Öl-/Gaskessel mit Speicher","2 chaudières à bois + 1 chaudière mazout/gaz avec accumulateur","2 caldaie a legna + 1 caldaia a gasolio/gas con accumulo","2 biomass boilers + 1 oil/gas boiler with storage"]
["WE",null,"Comparer les données de puissance avec données d'énergie (Figure ci-dessous liens dans Figures)","Vergleich Leistungsdaten mit Energiedaten (Grafik unten Links in Bilder)","Comparer les données de puissance avec données d'énergie (Figure ci-dessous liens dans Figures)","Confronto dei dati di potenza con i dati energetici (grafico in basso a sinistra in Immagini)","Comparison of performance data with energy data (diagram at the bottom left of Images)"]
["WE",null,"Écart de température calcul des données d'entrée","Temperaturspreizung berechnet aus Eingabedaten","Écart de température calcul des données d'entrée","Differenza della temperatura calcolata dai dati di input","Temperature difference according to input data"]
["WE",null,"Performance journalière moyenne maximale de la source de puissance de base [kW]","Max. mittlere Bandquellen-Tagesleist. [kW]","Performance journalière moyenne maximale de la source de puissance de base [kW]","Massima potenza media giornaliera della fonte di alimentazione di base [kW]","Max. average daily base load capacity [kW]"]
["WE",null,"Type de foyer","Feuerungsart","Type de foyer","Tipo di forno","Firing type"]
["WE",null,"Recommendations","Empfehlungen","Recommendations","Raccomandazioni","Recommendations"]
["WE",null,"Foyer à grille mobile","Vorschubrostfeuerungen","Foyer à grille mobile","Forno a griglia","Moving grate firing systems"]
["WE",null,"Foyer à poussée inférieure","Unterschub- und Festrostfeuerungen","Foyer à poussée inférieure","Forno sottoalimentato","Underfeed and fixed grate firing systems"]
["WE",null,"à allumage automatique","mit autom. Zündung","à allumage automatique","con accensione automatica","with autom. ignition"]
["WE",null,"avec maintien du lit de braise","mit Glutbettunterhalt","avec maintien du lit de braise","con stand-by (manutenzione del letto antincendio)","with firebed preservation"]
["WE",null,"Contenu en eau du combustible","Wassergehalt Brennstoff","Contenu en eau du combustible","Contenuto d'acqua del combustibile","Water content of fuel"]
["WE",null,{"$f":"IF(C$1=\"F\",E264,IF(C$1=\"I\",F264,IF(C$1=\"E\",G264,D264)))","v":"Moyenne de charge de chauffe journalière minimale en cas de fonctionnement à faible charge"},"Minimale mittlere Tagesheizlast in Prozent der Kesselnennleistung des kleinsten Kessels mit Wärnespeicher","Moyenne de charge de chauffe journalière minimale en cas de fonctionnement à faible charge","Carico minimo medio giornaliero di riscaldamento con funzionamento a basso carico","Minimum average daily heating load as a percentage of the nominalheat capacity of the smallest boiler with energy storage"]
["WE",null,"Correspond au tableau 13.4 du manuel de planification QM Chauffages au bois, 3e édition 2022 de l'édition allemande","Entspicht Tabelle 13.4 vom Planungshandbuch QM Holzheizwerke, 3. Auflage 2022","Correspond au tableau 13.4 du manuel de planification QM Chauffages au bois, 3e édition 2022 de l'édition allemande","Corrisponde alla tabella 13.4 del Manuale di pianificazione QM Impianti termici a legna, terza edizione 2022 dell'edizione tedesca.","Corresponds to Table 13.4 of the Planning Manual QM Wood-fired Heating Plants, 3rd edition 2022 of the German edition."]
["WE",null,"Remarque importante : selon le fabricant de la chaudière à bois, les valeurs peuvent varier légèrement varier. Les valeurs et les recommandations du fabricant de chaudières sont déterminantes.","Wichtiger Hinweis: Je nach Kesselhersteller können die Werte etwas abweichen. Massgebend sind immer die Werte und Empfehlungen des Kesselherstellers.","Remarque importante : selon le fabricant de la chaudière à bois, les valeurs peuvent varier légèrement varier. Les valeurs et les recommandations du fabricant de chaudières sont déterminantes.","Nota importante: a seconda del produttore della caldaia, i valori possono essere leggermente diversi. I valori e le raccomandazioni del produttore della caldaia sono sempre decisivi.","Important note: Depending on the boiler manufacturer, the values may differ slightly. The values and recommendations of the boiler manufacturer are always decisive."]

{"sheet":"Hilfsblatt","index":9,"n_rows":89,"n_cols":53,"rows_kept":89,"cut":false,"hidden":true,"merged":[[1,9,1,11]]}
[null,"Ausgezoge Lastkennlinien",null,null,null,null,null,"Wärmebedarfsbalken",null,null,null,null,null,null,null,null,null,null,{"$f":"IF(S2=1,\"Ja\",\"Nein\")","v":"Ja"},{"$f":"IF(T2=1,\"D\",IF(T2=2,\"F\",IF(T2=3,\"I\",\"E\")))","v":"F"},"Währung","Brennstoff","WE",null,null,null,"Tabellenblattnamen (werden über Makro umgeschalten)",null,null,null,null,null,null,null,null,null,{"$f":"OFFSET($AK$2,AL1,0)","v":0},3,null,{"$f":"OFFSET($AN$2,AL1,0)","v":25}]
[null,null,null,null,null,null,null,null,"Energiedaten","Leistungsdaten",null,null,null,null,null,null,null,null,1,2,1,1,1,null,null,"letzte","aktuelle Auswahl","deutsch","français","italiano","english"]
["Passwort für EXCEL_Situationserfassung:","AT","Fernleitung","Prozess","Warmwasser","Raumwärme",null,null,"Jahr","Winter","Sommer","Jahr",null,null,null,null,null,null,{"$f":"Text!C107","v":"oui"},"deutsch",{"$f":"Text!C109","v":"Franc Suisse"},{"$f":"Text!C111","v":"Plaquettes de bois"},{"$f":"Text!C238","v":"WE1"},1500,null,"Verbraucher",{"$f":"OFFSET(AB3,0,$T$2-1,1,1)","v":"Consommateurs"},"Verbraucher","Consommateurs","Consumatore","Consumers",null,null,null,null,null,3,"Deutschland (DE)",null,12]
["Holzenergie",{"$f":"C$31","v":-7},{"$f":"ROUND('Allgemeine Angaben'!$C$22,3)","v":49.4},{"$f":"ROUND($C4+'Allgemeine Angaben'!$C$20*'Allgemeine Angaben'!$C$32,3)","v":111},{"$f":"ROUND($D4+'Allgemeine Angaben'!$C$19*'Allgemeine Angaben'!$C$30,3)","v":373.5},{"$f":"ROUND((B4-B5)*F12+F5,3)","v":1448.6759999999999},null,"Raumwärme",{"$f":"'Allgemeine Angaben'!C27","v":2792},{"$f":"D33","v":2792.9544480000004},null,{"$f":"SUM(J4:K4)","v":2792.9544480000004},"Chaleure ambiante","Space heating","Calore ambienti",null,null,null,{"$f":"Text!C108","v":"non"},"français",{"$f":"Text!C110","v":"Euro"},{"$f":"Text!C112","v":"Granulé"},{"$f":"Text!C239","v":"WE2"},2000,null,"Allgemeine Angaben",{"$f":"OFFSET(AB4,0,$T$2-1,1,1)","v":"Informations generales"},"Allgemeine Angaben","Informations generales","Informazioni generali","General information",null,null,null,null,null,6,"Österreich (AT)",null,20]
[null,{"$f":"'Allgemeine Angaben'!C$12-'Allgemeine Angaben'!C$13+'Allgemeine Angaben'!C$14","v":-13},{"$f":"ROUND('Allgemeine Angaben'!$C$22,3)","v":49.4},{"$f":"ROUND($C5+'Allgemeine Angaben'!$C$20*'Allgemeine Angaben'!$C$32,3)","v":111},{"$f":"ROUND($D5+'Allgemeine Angaben'!$C$19*'Allgemeine Angaben'!$C$30,3)","v":373.5},{"$f":"ROUND($E5+'Allgemeine Angaben'!$C$18*SUM(Verbraucher!$C$54:$IV$54),3)","v":1723.5},null,"Warmwasser",{"$f":"'Allgemeine Angaben'!C29","v":641},{"$f":"ROUND('Allgemeine Angaben'!$C$29/8760*$J$9,3)","v":467.14},{"$f":"IF($S$1=\"Ja\",ROUND('Allgemeine Angaben'!$C$29/8760*$K$9,3),\"\")","v":173.86},{"$f":"SUM(J5:K5)","v":641},"Eau chaude","Domestic hot water","Acqua calda sanitaria",null,null,null,null,"italiano",null,null,{"$f":"Text!C240","v":"WE3"},2500,null,"Wärmezentrale","CentraleThermique","Wärmezentrale","CentraleThermique","Impianto di riscaldamento","Heating plant",null,null,null,null,null,0,"Schweiz (CH)",null,25]
[null,{"$f":"'Allgemeine Angaben'!C$14","v":15},{"$f":"ROUND('Allgemeine Angaben'!$C$22,3)","v":49.4},{"$f":"ROUND($C6+'Allgemeine Angaben'!$C$20*'Allgemeine Angaben'!$C$32,3)","v":111},{"$f":"ROUND($D6+'Allgemeine Angaben'!$C$19*'Allgemeine Angaben'!$C$30,3)","v":373.5},{"$f":"ROUND($E6+'Allgemeine Angaben'!$C$18*('Allgemeine Angaben'!$C$17/100)*SUM(Verbraucher!$C$54:$IV$54),3)","v":441},null,"Prozess",{"$f":"'Allgemeine Angaben'!C31","v":500},{"$f":"ROUND('Allgemeine Angaben'!$C$31/8760*$J$9,3)","v":364.38400000000001},{"$f":"IF($S$1=\"Ja\",ROUND('Allgemeine Angaben'!$C$31/8760*$K$9,3),\"\")","v":135.61600000000001},{"$f":"SUM(J6:K6)","v":500},"Chaleure industrielle","Preocess heat","Calore di processo",null,null,null,null,"english",null,null,{"$f":"Text!C241","v":"WE4"},3500,null,"Q-Plan Tabelle",{"$f":"OFFSET(AB6,0,$T$2-1,1,1)","v":"QM Tableau"},"Q-Plan Tabelle","QM Tableau","Q-piano","Q-plan table",null,null,null,null,null,9,"Slowenien (SI)",null,3]
[null,{"$f":"'Allgemeine Angaben'!C$14","v":15},{"$f":"IF($S$1=\"JA\",ROUND('Allgemeine Angaben'!$C$22,3),0)","v":49.4},{"$f":"IF($S$1=\"JA\",ROUND($C7+'Allgemeine Angaben'!$C$20*'Allgemeine Angaben'!$C$32,3),0)","v":111},{"$f":"IF($S$1=\"JA\",ROUND($D7+'Allgemeine Angaben'!$C$19*'Allgemeine Angaben'!$C$30,3),0)","v":373.5},{"$f":"$E7","v":373.5},null,"Fernleitung",{"$f":"'Allgemeine Angaben'!C21","v":432.6},{"$f":"ROUND('Allgemeine Angaben'!$C$22*$J$9/1000,3)","v":315.37},{"$f":"IF($S$1=\"Ja\",ROUND('Allgemeine Angaben'!$C$22*$K$9/1000,3),\"\")","v":117.374},{"$f":"SUM(J7:K7)","v":432.74400000000003},"Conduite à distance","District heating","Rete di teleriscaldamento",null,null,null,null,null,null,null,{"$f":"Text!C242","v":"WE5"},1500,null,"AT-Vergleich",{"$f":"OFFSET(AB7,0,$T$2-1,1,1)","v":"Comparaison TE"},"AT-Vergleich","Comparaison TE","Temp confronto","Amb-temp comparison",null,null,null,null,null,12,"Italien (IT)",null,8]
[null,{"$f":"'Allgemeine Angaben'!C$13","v":21},{"$f":"IF($S$1=\"JA\",ROUND('Allgemeine Angaben'!$C$22,3),0)","v":49.4},{"$f":"IF($S$1=\"JA\",ROUND($C8+'Allgemeine Angaben'!$C$20*'Allgemeine Angaben'!$C$32,3),0)","v":111},{"$f":"IF($S$1=\"JA\",ROUND($D8+'Allgemeine Angaben'!$C$19*'Allgemeine Angaben'!$C$30,3),0)","v":373.5},{"$f":"$E8","v":373.5},null,null,{"$f":"SUM(I4:I7)","v":4365.6000000000004},null,null,null,null,null,null,null,null,null,null,null,null,null,{"$f":"Text!C243","v":"WE6"},2000]
[null,30,{"$f":"IF($S$1=\"JA\",ROUND('Allgemeine Angaben'!$C$22,3),0)","v":49.4},{"$f":"IF($S$1=\"JA\",ROUND($C9+'Allgemeine Angaben'!$C$20*'Allgemeine Angaben'!$C$32,3),0)","v":111},{"$f":"IF($S$1=\"JA\",ROUND($D9+'Allgemeine Angaben'!$C$19*'Allgemeine Angaben'!$C$30,3),0)","v":373.5},{"$f":"$E9","v":373.5},null,"Heizstunden",null,{"$f":"E32*24","v":6384},{"$f":"365*24-J9","v":2376},null,null,null,null,null,null,null,null,null,null,null,{"$f":"Text!C244","v":"WE7"},2500,null,null,null,"Bilder_DE","Figures_FR","Immagini_IT","Images_EN"]
[null,null,null,null,null,null,null,null,null,null,null,null,null,null,null,null,null,null,null,null,null,null,{"$f":"Text!C245","v":"WE8"},3000,null,null,{"$f":"OFFSET(AB10,0,$T$2-1,1,1)","v":"Figures"},"Bilder","Figures","Immagini","Images",null,null,null,null,null,null,null,null,null,"CH",null,null,"DE",null,null,"AT",null,null,"SI",null,null,"IT"]
["Paralellverschiebung",null,null,null,null,{"$f":"ROUND(INDEX(LINEST(F$5:F$6,B$5:B$6),2)-E5,3)","v":754.55399999999997},null,"Gesamt",{"$f":"SUM(I4:I7)","v":4365.6000000000004},{"$f":"SUM(J4:J7)","v":3939.8484480000002},{"$f":"SUM(K4:K7)","v":426.85},{"$f":"SUM(L4:L7)","v":4366.6984480000001},"Total","Total","Totale",null,null,null,null,null,null,null,{"$f":"Text!C204","v":"Aucun"},"–",null,null,null,null,null,null,null,null,null,null,null,null,{"$f":"OFFSET($AK$12,AL11,0)","v":6},25]
["Steilheit",null,null,null,null,{"$f":"ROUND(INDEX(LINEST(F$5:F$6,B$5:B$6),1),3)","v":-45.804000000000002},null,"Holzkessel",null,{"$f":"AF32","v":3939.8528159999996},{"$f":"AF31","v":426.85315200000059},{"$f":"AF33","v":4366.7059680000002},"Chaudière à bois","Biomass boiler","Caldaia a legna"]
[null,null,null,null,null,null,null,"Bandleistungsquelle",null,{"$f":"X32","v":0},{"$f":"X31","v":0},{"$f":"X33","v":0},"Source de puissance de base","Base load source","Fonte di alimentazione di base",null,null,null,null,null,null,null,null,null,null,null,null,null,null,null,null,null,null,null,null,null,{"$f":"IF(OFFSET($AO13,,$AK$1)=\"\",\"\",OFFSET($AN13,,$AK$1))","v":190},{"$f":"IF(OFFSET($AO13,,$AK$1)=\"\",\"\",OFFSET($AO13,,$AK$1))","v":"Andermatt (CH), 1442 m ü. M."},null,190,"Andermatt (CH), 1442 m ü. M.",null,62,"Augsburg (DE), 461 m ü. M.",null,122,"Bad Aussee (AT), 659 m ü. M.",null,42,"BILJE (SI), 55 m ü. M.",null,222,"Barcis (IT) 409 m s.l.m."]
[null,"Unsichtbare Lastkennlinien",null,null,null,null,null,"Gesamt",null,{"$f":"J11/$L$11*100","v":90.224880305268101},9.7751196947318952,100,null,null,null,null,null,null,null,null,null,null,null,null,null,null,null,null,null,null,null,null,null,null,null,null,194,{"$f":"IF(OFFSET($AO14,,$AK$1)=\"\",\"\",OFFSET($AO14,,$AK$1))","v":"Acquarossa/Comprovasco (CH), 575 m ü. M."},null,194,"Acquarossa/Comprovasco (CH), 575 m ü. M.",null,66,"Bamberg (DE), 240 m ü. M.",null,126,"Bregenz (AT), 427 m ü. M.",null,38,"BRNIK LETALIŠČE (SI), 364 m ü. M.",null,226,"Codroipo (IT) 43 m s.l.m."]
[null,null,null,null,null,null,null,"Holzkessel",null,90.224980335074406,9.7751918774126576,100.00017221248707,null,null,null,null,null,null,null,null,null,null,null,null,null,null,null,null,null,null,null,null,null,null,null,null,198,"Bad Ragaz (CH), 496 m ü. M.",null,198,"Bad Ragaz (CH), 496 m ü. M.",null,50,"Frankfurt/Main Flughafen (DE), 112 m ü. M.",null,130,"Eisenstadt (AT), 182 m ü. M.",null,46,"NOVA VAS [BLOKE] (SI), 722 m ü. M.",null,230,"Forni di Sopra (IT) 907 m s.l.m."]
[null,"AT","Fernleitung","Prozess","Warmwasser","Raumwärme",null,"Bandleistungsquelle",null,0,0,0,null,null,null,null,null,null,null,null,"WENN(Hilfsblatt!S1=\"Nein\";Hilfsblatt!F19-Hilfsblatt!AA31;Hilfsblatt!F20-Hilfsblatt!AA31)",null,null,null,null,null,null,null,null,null,null,null,null,null,null,null,86,"Basel-Binningen (CH), 316 m ü. M.",null,86,"Basel-Binningen (CH), 316 m ü. M.",null,70,"Hof (DE), 565 m ü. M.",null,134,"Freistadt (AT), 560 m ü. M.",null,null,null,null,234,"Gemona (IT) 272 m s.l.m."]
[null,{"$f":"C$31","v":-7},{"$f":"ROUND('Allgemeine Angaben'!$C$22,3)","v":49.4},{"$f":"ROUND($C17+'Allgemeine Angaben'!$C$31*1000/8760,3)","v":106.47799999999999},{"$f":"ROUND($D17+'Allgemeine Angaben'!$C$29*1000/8760,3)","v":179.65199999999999},{"$f":"ROUND((B17-B18)*F25+F18,3)","v":1196.2919999999999},null,null,null,null,null,null,null,null,null,null,null,null,null,null,null,null,null,null,null,null,null,null,null,null,null,null,null,null,null,null,90,"Bern/Zollikofen (CH), 553 m ü. M.",null,90,"Bern/Zollikofen (CH), 553 m ü. M.",null,34,"Hohenpeißenberg (DE), 977 m ü. M.",null,138,"Fürstenfeld (AT), 276 m ü. M.",null,null,null,null,238,"San Pietro al Nasitone (IT) 175 m s.l.m."]
[null,{"$f":"'Allgemeine Angaben'!C$12-'Allgemeine Angaben'!C$13+'Allgemeine Angaben'!C$14","v":-13},{"$f":"ROUND('Allgemeine Angaben'!$C$22,3)","v":49.4},{"$f":"ROUND($C18+'Allgemeine Angaben'!$C$31*1000/8760,3)","v":106.47799999999999},{"$f":"ROUND($D18+'Allgemeine Angaben'!$C$29*1000/8760,3)","v":179.65199999999999},{"$f":"ROUND($E18+SUM(Verbraucher!$C$53:$IV$53),3)","v":1456.152},null,null,null,null,null,null,null,null,null,null,null,null,null,null,null,null,null,null,null,null,null,null,null,null,null,null,null,null,null,null,254,"Bullet / La Fretaz (CH), 1205 m ü. M.",null,254,"Bullet / La Fretaz (CH), 1205 m ü. M.",null,58,"Kahler Asten (DE), 839 m ü. M.",null,14,"Graz Universität (AT), 353 m ü. M.",null,null,null,null,242,"Sgonico (IT) 278 m s.l.m."]
[null,{"$f":"'Allgemeine Angaben'!C$14","v":15},{"$f":"ROUND('Allgemeine Angaben'!$C$22,3)","v":49.4},{"$f":"ROUND($C19+'Allgemeine Angaben'!$C$31*1000/8760,3)","v":106.47799999999999},{"$f":"ROUND($D19+'Allgemeine Angaben'!$C$29*1000/8760,3)","v":179.65199999999999},{"$f":"ROUND($E19+'Allgemeine Angaben'!$C$17/100*SUM(Verbraucher!$C$53:$IV$53),3)","v":243.477},null,null,null,null,null,null,null,null,null,null,null,null,null,null,null,null,null,null,null,null,null,null,null,null,null,null,null,null,null,null,202,"Château-d'Oex (CH), 1029 m ü. M.",null,202,"Château-d'Oex (CH), 1029 m ü. M.",null,26,"Karlsruhe/Rheinstetten (DE), 116 m ü. M.",null,142,"Hohenau/March (AT), 155 m ü. M.",null,null,null,null,246,"Tarvisio (IT) 754 m s.l.m."]
[null,{"$f":"'Allgemeine Angaben'!C$14","v":15},{"$f":"IF($S$1=\"JA\",ROUND('Allgemeine Angaben'!$C$22,3),0)","v":49.4},{"$f":"IF($S$1=\"JA\",ROUND($C20+'Allgemeine Angaben'!$C$31*1000/8760,3),0)","v":106.47799999999999},{"$f":"IF($S$1=\"JA\",ROUND($D20+'Allgemeine Angaben'!$C$29*1000/8760,3),0)","v":179.65199999999999},{"$f":"$E20","v":179.65199999999999},null,null,null,null,null,null,null,null,null,null,null,null,null,null,null,null,null,null,null,null,null,null,null,null,null,null,null,null,null,null,2,"Davos (CH), 1594 m ü. M.",null,2,"Davos (CH), 1594 m ü. M.",null,74,"Kempten (DE), 705 m ü. M.",null,146,"Innsbruck Universität (AT), 574 m ü. M.",null,null,null,null,250,"Tolmezzo (IT) 323 m s.l.m."]
[null,{"$f":"'Allgemeine Angaben'!C$13","v":21},{"$f":"IF($S$1=\"JA\",ROUND('Allgemeine Angaben'!$C$22,3),0)","v":49.4},{"$f":"IF($S$1=\"JA\",ROUND($C21+'Allgemeine Angaben'!$C$31*1000/8760,3),0)","v":106.47799999999999},{"$f":"IF($S$1=\"JA\",ROUND($D21+'Allgemeine Angaben'!$C$29*1000/8760,3),0)","v":179.65199999999999},{"$f":"$E21","v":179.65199999999999},null,null,null,null,null,null,null,null,null,null,null,null,null,{"$f":"IF(AA$31=0,0,IF(AA$31>=L36,IF(L36>=T35,L36,IF(S$1=\"JA\",T35,IF(AA$31<=L36,AA$31,L36))),T35))","v":0},null,null,null,null,null,null,null,null,null,null,null,null,null,null,null,null,206,"Disentis/Sedrun (CH), 1197 m ü. M.",null,206,"Disentis/Sedrun (CH), 1197 m ü. M.",null,30,"München Flughafen (DE), 446 m ü. M.",null,150,"Klagenfurt Flughafen (AT), 446 m ü. M."]
[null,30,{"$f":"IF($S$1=\"JA\",ROUND('Allgemeine Angaben'!$C$22,3),0)","v":49.4},{"$f":"IF($S$1=\"JA\",ROUND($C22+'Allgemeine Angaben'!$C$31*1000/8760,3),0)","v":106.47799999999999},{"$f":"IF($S$1=\"JA\",ROUND($D22+'Allgemeine Angaben'!$C$29*1000/8760,3),0)","v":179.65199999999999},{"$f":"$E22","v":179.65199999999999},null,null,null,null,null,null,null,null,null,null,null,null,null,null,null,null,null,null,null,null,null,null,null,null,null,null,null,null,null,null,258,"Einsiedeln (CH), 910 m ü. M.",null,258,"Einsiedeln (CH), 910 m ü. M.",null,78,"Nürnberg (DE), 314 m ü. M.",null,154,"Kufstein (AT), 499 m ü. M."]
[null,null,null,null,null,null,null,null,null,null,null,null,null,null,null,null,null,null,null,null,null,null,null,null,null,null,null,null,null,null,null,null,null,null,null,null,98,"Engelberg (CH), 1036 m ü. M.",null,98,"Engelberg (CH), 1036 m ü. M.",null,54,"Trier-Petrisberg (DE), 265 m ü. M.",null,158,"Lienz (AT), 673 m ü. M."]
["Paralellverschiebung",null,null,null,null,{"$f":"ROUND(INDEX(LINEST(F$18:F$19,B$18:B$19),2)-E18,3)","v":713.47199999999998},null,null,null,null,null,null,null,null,null,null,null,null,null,null,null,null,null,null,null,null,null,null,null,null,null,null,null,null,null,null,210,"Fribourg/Posieux (CH), 646 m ü. M.",null,210,"Fribourg/Posieux (CH), 646 m ü. M.",null,82,"Würzburg (DE), 268 m ü. M.",null,162,"Linz Stadt (AT), 266 m ü. M."]
["Steilheit",null,null,null,null,{"$f":"ROUND(INDEX(LINEST(F$18:F$19,B$18:B$19),1),3)","v":-43.31},null,null,null,null,null,null,null,null,null,null,null,null,null,null,null,null,null,null,null,null,null,null,null,null,null,null,null,null,null,null,94,"La Chaux-de-Fonds (CH), 1018 m ü. M.",null,94,"La Chaux-de-Fonds (CH), 1018 m ü. M.",null,null,null,null,166,"Mariazell (AT), 868 m ü. M."]
[null,null,null,null,null,null,null,null,null,null,null,null,null,null,null,null,null,null,null,null,null,null,null,null,"Bandquelle",null,"Min. Leistung",null,null,null,null,null,"Holzkessel",null,null,null,262,"Langnau i.E. (CH), 745 m ü. M.",null,262,"Langnau i.E. (CH), 745 m ü. M.",null,null,null,null,170,"Salzburg-Freisaal (AT), 424 m ü. M."]
[null,null,null,null,null,null,null,null,null,null,null,null,null,null,null,null,null,null,null,null,null,null,null,null,null,null,{"$f":"IF(T$1=\"FR\",IF(Figures!M7=\"\",0,Figures!M7),IF(T$1=\"SI\",IF(Bilder_IT!M6=\"\",0,Bilder_IT!M6),IF(Bilder!M7=\"\",0,Bilder!M7)))","v":67.5},{"$f":"AA27+Y31","v":67.5},null,{"$f":"MAX(AD34:AD87)","v":179.65199999999999},null,null,null,null,null,null,10,"Locarno/Monti (CH), 367 m ü. M.",null,10,"Locarno/Monti (CH), 367 m ü. M.",null,null,null,null,174,"Schröcken (AT), 1269 m ü. M."]
[null,null,null,null,null,null,null,null,null,null,null,null,null,null,null,null,null,null,null,null,null,null,{"$f":"IF(OR($G29=\"Acquarossa/Comprovasco (CH), 575 m ü. M.\",$G29=\"Pully (CH), 456 m ü. M.\",$G29=\"Schröcken (AT), 1269 m ü. M.\",$G29=\"Augsburg (DE), 461 m ü. M.\",$G29=\"Bamberg (DE), 240 m ü. M.\",$G29=\"Karlsruhe/Rheinstetten (DE), 116 m ü. M.\",$G29=\"BILJE (SI), 55 m ü. M.\"),2,1)","v":1},null,"Min. Leistung",null,"Max. Leistung",null,null,null,{"$f":"IF(OR($G29=\"Acquarossa/Comprovasco (CH), 575 m ü. M.\",$G29=\"Pully (CH), 456 m ü. M.\",$G29=\"Schröcken (AT), 1269 m ü. M.\",$G29=\"Augsburg (DE), 461 m ü. M.\",$G29=\"Bamberg (DE), 240 m ü. M.\",$G29=\"Karlsruhe/Rheinstetten (DE), 116 m ü. M.\",$G29=\"BILJE (SI), 55 m ü. M.\"),2,1)","v":1},null,"Min. Leistung",null,null,null,102,"Luzern (CH), 454 m ü. M.",null,102,"Luzern (CH), 454 m ü. M.",null,null,null,null,178,"St. Pölten (AT), 267 m ü. M."]
["Klimastation",null,null,null,null,null,{"$f":"OFFSET($AL$12,AL11,0)","v":"Zürich/Fluntern (CH), 556 m ü. M."},null,null,null,null,null,null,null,null,null,null,null,null,null,null,null,null,null,{"$f":"ROUND(MIN(Y33:Y87),0)","v":0},null,{"$f":"IF(T$1=\"FR\",IF(Figures!M8=\"\",10^10,Figures!M8),IF(T$1=\"IT\",IF(Bilder_IT!M7=\"\",10^10,Bilder_IT!M7),IF(Bilder!M8=\"\",10^10,Bilder!M8)))","v":1305},{"$f":"AA29+Y31","v":1305},null,null,null,null,{"$f":"ROUND(AD27-T31,0)","v":180},null,null,null,266,"Payerne (CH), 490 m ü. M.",null,266,"Payerne (CH), 490 m ü. M.",null,null,null,null,18,"Tamsweg (AT), 1022 m ü. M."]
[null,null,null,null,null,null,null,null,null,{"$f":"C31-B36","v":13},{"$f":"IF($S$1=\"JA\",365,$K$36)","v":365},{"$f":"$E$19","v":179.65199999999999},null,null,null,null,null,null,null,null,null,null,null,null,"Max. Leistung",null,"Bandleistung",null,null,null,null,null,"Max. Leistung",null,null,null,214,"Piotta (CH), 990 m ü. M.",null,214,"Piotta (CH), 990 m ü. M.",null,null,null,null,22,"Wien innere Stadt (AT), 170 m ü. M."]
["Tiefste Aussentemperatur [°C]",null,{"$f":"MIN(C36:C86)","v":-7},null,null,null,null,null,null,null,1,{"$f":"$L$30","v":179.65199999999999},null,null,null,null,null,null,null,{"$f":"MAX(T33:T89)","v":0},null,null,null,{"$f":"X33-X32","v":0},{"$f":"ROUND(MAX(Y33:Y87),0)","v":0},null,{"$f":"IF(T$1=\"FR\",IF(Figures!M9=\"\",10^10,Figures!M9),IF(T$1=\"IT\",IF(Bilder_IT!M8=\"\",10^10,Bilder_IT!M8),IF(Bilder!M9=\"\",10^10,Bilder!M9)))","v":0},null,null,null,null,{"$f":"AF33-AF32","v":426.85315200000059},{"$f":"ROUND(MAX(AG33:AG87),0)","v":1196},null,null,null,106,"Pully (CH), 456 m ü. M.",null,106,"Pully (CH), 456 m ü. M.",null,null,null,null,182,"Zell am See (AT), 750 m ü. M."]
["Heiztage",null,null,null,{"$f":"ROUND(SUM(E36:E86)/24,1)","v":266},null,{"$f":"SUM(G36:G86)","v":365},null,null,null,null,null,null,null,null,null,null,null,null,null,null,null,null,{"$f":"SUM(X36:X86)","v":0},null,null,null,null,null,null,null,{"$f":"SUM(AF36:AF86)","v":3939.8528159999996},null,{"$f":"SUM(AH36:AH86)","v":3939.8528159999996},null,null,270,"Rünenberg (CH), 611 m ü. M.",null,270,"Rünenberg (CH), 611 m ü. M.",null,null,null,null,186,"Zeltweg (AT), 659 m ü. M."]
["Heizwärmebedarf [MWh/a] (inkl. nicht witterungsabhängigem Anteil)",null,null,{"$f":"SUM(D36:D86)/1000","v":2792.9544480000004},null,null,null,null,null,null,null,null,null,null,null,null,null,null,null,0,{"$f":"U34","v":0},null,{"$f":"SUM(W35:W86)","v":364},{"$f":"SUM(X35:X86)","v":0},null,null,{"$f":"T$31","v":0},{"$f":"AB34","v":365},null,null,{"$f":"SUM(AE35:AE86)","v":365},{"$f":"SUM(AF35:AF86)","v":4366.7059680000002},{"$f":"IF(S$1=\"NEIN\",0,IF(AA33>0,AA33,0))","v":0},null,null,null,110,"Samedan (CH), 1709 m ü. M.",null,110,"Samedan (CH), 1709 m ü. M."]
["Nicht witterunsabhängiger Anteil [MWh/a]",null,null,{"$f":"ROUND((F6-F7)*E32*24/1000,3)","v":430.92},null,null,null,null,null,null,365,{"$f":"IF($S$1=\"JA\",$L$30,0)","v":179.65199999999999},null,null,null,null,null,null,null,{"$f":"IF(AA$31=0,0,IF(AA$31>=L34,L34,AA$31))","v":0},{"$f":"IF(U89<365,U89,365)","v":0},{"$f":"IF(AND(T33=0,T34>0),$K34,\"\")","v":""},null,null,{"$f":"IF(T34>0,T34,0)","v":0},null,{"$f":"IF(L34<AB$27,AA33,IF(L34>AB$29,AA33,IF(L34<T$31,T$31,L34)))","v":179.65199999999999},{"$f":"IF(AB89<365,AB89,365)","v":365},{"$f":"IF(AND(AA33=T$31,AA34>T$31),IF(AB$27<T$31,K33,K34),\"\")","v":365},{"$f":"IF(AC34=\"\",\"\",AA34)","v":179.65199999999999},null,null,{"$f":"IF(S$1=\"NEIN\",0,IF(AA34>0,AA34,0))","v":179.65199999999999},null,null,null,114,"St. Gallen (CH), 776 m ü. M.",null,114,"St. Gallen (CH), 776 m ü. M."]
[null,null,null,null,null,null,null,null,null,null,{"$f":"E32","v":266},{"$f":"IF($S$1=\"JA\",$L$30,0)","v":179.65199999999999},null,null,null,null,null,null,null,{"$f":"IF(AA$31=0,0,IF(AA$31>=L35,IF(L35>=T34,L35,T34),T34))","v":0},{"$f":"IF(AND(T35=0,T36>0),K36,IF(T35=0,U$89,K35))","v":0},"",{"$f":"(365-U36)","v":365},{"$f":"W35*24*T35/1000","v":0},{"$f":"IF(T35>0,T35,0)","v":0},null,179.65199999999999,{"$f":"IF(AND(AA35=T$31,AA36>T$31),IF(AB$27<T$31,K35,K36),IF(AA35=T$31,AB$89,K35))","v":266},"",{"$f":"IF(AC35=\"\",\"\",AA35)","v":""},{"$f":"(365-AB36)","v":99},{"$f":"IF(AE36=0,0,AE35*24*(AA35-T36)/1000)","v":426.85315199999997},{"$f":"IF(S$1=\"NEIN\",0,IF(AA35>0,AA35,0))","v":179.65199999999999},{"$f":"AE35*AG35*24/1000","v":426.85315200000002},null,null,218,"Ulrichen (CH), 1346 m ü. M.",null,218,"Ulrichen (CH), 1346 m ü. M."]
[null,-20,{"$f":"IF(OR(G36=0,B36>B$6),\"\",B36)","v":""},{"$f":"IF(C36=\"\",\"\",ROUND((B36*F$25+F$24)*E36,3))","v":""},{"$f":"IF(C36=\"\",\"\",G36*24)","v":""},0,{"$f":"OFFSET(Klimadaten!$B$10,$F36,$AK$11)","v":0},{"$f":"G36","v":0},{"$f":"IF(OR($G36=0,$B36>$B$6),-10,$B36*$F$25+$F$24+$L$30)","v":-10},{"$f":"86+(B20-B22)-36","v":35},{"$f":"OFFSET(H$36,$J36,0)","v":266},{"$f":"OFFSET(I$36,$J36,0)","v":243.47399999999988},{"$f":"IF(G36=0,-25,B36)","v":-25},{"$f":"OFFSET(Klimadaten!$B$10,$F36,$AK$11-1)","v":0},{"$f":"N36","v":0},{"$f":"IF(N36=0,-25,$B36)","v":-25},{"$f":"OFFSET(Klimadaten!$B$10,$F36,$AK$11+1)","v":0},{"$f":"Q36","v":0},{"$f":"IF(Q36=0,-25,$B36)","v":-25},{"$f":"IF(AA$31=0,0,IF(AA$31>=L36,IF(L36>=T35,L36,T35),IF(S$1=\"JA\",T35,IF(AA$31<=L36,AA$31,L36))))","v":0},0,"",{"$f":"IF(AND(U36=W$28,U35>W$28),(U36-U37)+W$28,U36-U37)","v":0},{"$f":"W36*24*T36/1000","v":0},{"$f":"IF(T36>0,T36,0)","v":0},null,243.47399999999988,266,"","",{"$f":"IF(AND(AB36=AE$28,AB35>AE$28),(AB36-AB37)+AE$28,AB36-AB37)","v":16},{"$f":"AE36*24*(AA36-T36)/1000","v":93.494015999999945},{"$f":"IF(AA36>0,AA36-T36,0)","v":243.47399999999988},{"$f":"AE36*AG36*24/1000","v":93.494015999999945},null,null,118,"Visp (CH), 639 m ü. M.",null,118,"Visp (CH), 639 m ü. M."]
[null,{"$f":"B36+1","v":-19},"",{"$f":"IF(C37=\"\",\"\",ROUND((B37*F$25+F$24)*E37,3))","v":""},{"$f":"IF(C37=\"\",\"\",G37*24)","v":""},{"$f":"F36+1","v":1},{"$f":"OFFSET(Klimadaten!$B$10,$F37,$AK$11)","v":0},{"$f":"H36+G37","v":0},-10,{"$f":"IF(J36-1<J$30,J$30,J36-1)","v":34},{"$f":"OFFSET(H$36,$J37,0)","v":250},{"$f":"OFFSET(I$36,$J37,0)","v":286.78399999999993},{"$f":"IF(G37=0,-25,B37)","v":-25},{"$f":"OFFSET(Klimadaten!$B$10,$F37,$AK$11-1)","v":0},{"$f":"O36+N37","v":0},{"$f":"IF(N37=0,-25,$B37)","v":-25},{"$f":"OFFSET(Klimadaten!$B$10,$F37,$AK$11+1)","v":0},{"$f":"R36+Q37","v":0},{"$f":"IF(Q37=0,-25,$B37)","v":-25},{"$f":"IF(AA$31=0,0,IF(AA$31>=L37,IF(L37>=T36,L37,T36),T36))","v":0},0,"",0,0,{"$f":"IF(T37>0,T37,0)","v":0},null,286.78399999999993,250,"","",16,{"$f":"AE37*24*(AA37-T37)/1000","v":110.12505599999999},{"$f":"IF(AA37>0,AA37-T37,0)","v":286.78399999999993},110.12505599999999,null,null,6,"Zürich/Fluntern (CH), 556 m ü. M.",null,6,"Zürich/Fluntern (CH), 556 m ü. M."]
[null,-18,"","","",{"$f":"F37+1","v":2},{"$f":"OFFSET(Klimadaten!$B$10,$F38,$AK$11)","v":0},0,-10,{"$f":"IF(J37-1<J$30,J$30,J37-1)","v":33},234,330.09399999999999,{"$f":"IF(G38=0,-25,B38)","v":-25},{"$f":"OFFSET(Klimadaten!$B$10,$F38,$AK$11-1)","v":0},{"$f":"O37+N38","v":0},-25,{"$f":"OFFSET(Klimadaten!$B$10,$F38,$AK$11+1)","v":0},{"$f":"R37+Q38","v":0},{"$f":"IF(Q38=0,-25,$B38)","v":-25},0,0,"",0,0,0,null,330.09399999999999,234,"","",17,134.67835199999999,330.09399999999999,134.67835200000002]
[null,-17,"","","",3,{"$f":"OFFSET(Klimadaten!$B$10,$F39,$AK$11)","v":0},0,-10,32,217,373.40399999999994,-25,{"$f":"OFFSET(Klimadaten!$B$10,$F39,$AK$11-1)","v":0},0,-25,{"$f":"OFFSET(Klimadaten!$B$10,$F39,$AK$11+1)","v":0},0,-25,0,0,"",0,0,0,null,373.40399999999994,217,"","",17,152.34883199999996,373.40399999999994,152.34883199999996]
[null,-16,"","","",4,{"$f":"OFFSET(Klimadaten!$B$10,$F40,$AK$11)","v":0},0,-10,31,200,416.71399999999994,-25,{"$f":"OFFSET(Klimadaten!$B$10,$F40,$AK$11-1)","v":0},0,-25,{"$f":"OFFSET(Klimadaten!$B$10,$F40,$AK$11+1)","v":0},0,-25,0,0,"",0,0,0,null,416.71399999999994,200,"","",13,130.01476799999998,416.71399999999994,130.01476799999998]
[null,-15,"","","",5,{"$f":"OFFSET(Klimadaten!$B$10,$F41,$AK$11)","v":0},0,-10,30,187,460.02399999999994,-25,{"$f":"OFFSET(Klimadaten!$B$10,$F41,$AK$11-1)","v":0},0,-25,{"$f":"OFFSET(Klimadaten!$B$10,$F41,$AK$11+1)","v":0},0,-25,0,0,"",0,0,0,null,460.02399999999994,187,"","",13,143.52748799999998,460.02399999999994,143.52748799999998]
[null,-14,"","","",6,{"$f":"OFFSET(Klimadaten!$B$10,$F42,$AK$11)","v":0},0,-10,29,174,503.33399999999995,-25,{"$f":"OFFSET(Klimadaten!$B$10,$F42,$AK$11-1)","v":0},0,-25,{"$f":"OFFSET(Klimadaten!$B$10,$F42,$AK$11+1)","v":0},0,-25,0,0,"",0,0,0,null,503.33399999999995,174,"","",15,181.20023999999998,503.33399999999995,181.20023999999998]
[null,-13,"","","",7,{"$f":"OFFSET(Klimadaten!$B$10,$F43,$AK$11)","v":0},0,-10,28,159,546.64400000000001,-25,{"$f":"OFFSET(Klimadaten!$B$10,$F43,$AK$11-1)","v":0},0,-25,{"$f":"OFFSET(Klimadaten!$B$10,$F43,$AK$11+1)","v":0},0,-25,0,0,"",0,0,0,null,546.64400000000001,159,"","",14,183.67238399999999,546.64400000000001,183.67238399999999]
[null,-12,"","","",8,{"$f":"OFFSET(Klimadaten!$B$10,$F44,$AK$11)","v":0},0,-10,27,145,589.95399999999995,-25,{"$f":"OFFSET(Klimadaten!$B$10,$F44,$AK$11-1)","v":0},0,-25,{"$f":"OFFSET(Klimadaten!$B$10,$F44,$AK$11+1)","v":0},0,-25,0,0,"",0,0,0,null,589.95399999999995,145,"","",15,212.38343999999998,589.95399999999995,212.38344000000001]
[null,-11,"","","",9,{"$f":"OFFSET(Klimadaten!$B$10,$F45,$AK$11)","v":0},0,-10,26,130,633.2639999999999,-25,{"$f":"OFFSET(Klimadaten!$B$10,$F45,$AK$11-1)","v":0},0,-25,{"$f":"OFFSET(Klimadaten!$B$10,$F45,$AK$11+1)","v":0},0,-25,0,0,"",0,0,0,null,633.2639999999999,130,"","",14,212.77670399999997,633.2639999999999,212.77670399999997]
[null,-10,"","","",10,{"$f":"OFFSET(Klimadaten!$B$10,$F46,$AK$11)","v":0},0,-10,25,116,676.57399999999996,-25,{"$f":"OFFSET(Klimadaten!$B$10,$F46,$AK$11-1)","v":1},1,-10,{"$f":"OFFSET(Klimadaten!$B$10,$F46,$AK$11+1)","v":0},0,-25,0,0,"",0,0,0,null,676.57399999999996,116,"","",12,194.85331199999999,676.57399999999996,194.85331199999999]
[null,-9,"","","",11,{"$f":"OFFSET(Klimadaten!$B$10,$F47,$AK$11)","v":0},0,-10,24,104,719.88400000000001,-25,{"$f":"OFFSET(Klimadaten!$B$10,$F47,$AK$11-1)","v":1},2,-9,{"$f":"OFFSET(Klimadaten!$B$10,$F47,$AK$11+1)","v":0},0,-25,0,0,"",0,0,0,null,719.88400000000001,104,"","",13,224.60380800000001,719.88400000000001,224.60380800000001]
[null,-8,"","","",12,{"$f":"OFFSET(Klimadaten!$B$10,$F48,$AK$11)","v":0},0,-10,23,{"$f":"OFFSET(H$36,$J48,0)","v":91},763.19399999999996,-25,{"$f":"OFFSET(Klimadaten!$B$10,$F48,$AK$11-1)","v":3},5,-8,{"$f":"OFFSET(Klimadaten!$B$10,$F48,$AK$11+1)","v":0},0,-25,0,0,"",0,0,0,null,763.19399999999996,91,"","",17,311.383152,763.19399999999996,311.383152]
[null,-7,-7,24399.407999999999,24,13,{"$f":"OFFSET(Klimadaten!$B$10,$F49,$AK$11)","v":1},1,1196.2940000000001,22,74,806.50399999999991,-7,{"$f":"OFFSET(Klimadaten!$B$10,$F49,$AK$11-1)","v":4},9,-7,{"$f":"OFFSET(Klimadaten!$B$10,$F49,$AK$11+1)","v":0},0,-25,0,0,"",0,0,0,null,806.50399999999991,74,"","",14,270.985344,806.50399999999991,270.985344]
[null,-6,-6,46719.936000000002,48,14,{"$f":"OFFSET(Klimadaten!$B$10,$F50,$AK$11)","v":2},3,1152.9839999999999,21,60,849.81400000000008,-6,{"$f":"OFFSET(Klimadaten!$B$10,$F50,$AK$11-1)","v":4},13,-6,{"$f":"OFFSET(Klimadaten!$B$10,$F50,$AK$11+1)","v":0},0,-25,0,0,"",0,0,0,null,849.81400000000008,60,"","",13,265.14196800000008,849.81400000000008,265.14196800000002]
[null,-5,-5,111602.64,120,15,{"$f":"OFFSET(Klimadaten!$B$10,$F51,$AK$11)","v":5},8,1109.674,20,47,893.12400000000002,-5,{"$f":"OFFSET(Klimadaten!$B$10,$F51,$AK$11-1)","v":8},21,-5,{"$f":"OFFSET(Klimadaten!$B$10,$F51,$AK$11+1)","v":1},1,-5,0,0,"",0,0,0,null,893.12400000000002,47,"","",12,257.21971200000002,893.12400000000002,257.21971200000002]
[null,-4,-4,106405.44,120,16,{"$f":"OFFSET(Klimadaten!$B$10,$F52,$AK$11)","v":5},13,1066.364,19,35,936.43399999999997,-4,{"$f":"OFFSET(Klimadaten!$B$10,$F52,$AK$11-1)","v":8},29,-4,{"$f":"OFFSET(Klimadaten!$B$10,$F52,$AK$11+1)","v":3},4,-4,0,0,"",0,0,0,null,936.43399999999997,35,"","",8,179.79532799999998,936.43399999999997,179.79532799999998]
[null,-3,-3,141691.53599999999,168,17,{"$f":"OFFSET(Klimadaten!$B$10,$F53,$AK$11)","v":7},20,1023.0540000000001,18,27,979.74399999999991,-3,{"$f":"OFFSET(Klimadaten!$B$10,$F53,$AK$11-1)","v":11},40,-3,{"$f":"OFFSET(Klimadaten!$B$10,$F53,$AK$11+1)","v":4},8,-3,0,0,"",0,0,0,null,979.74399999999991,27,"","",7,164.596992,979.74399999999991,164.596992]
[null,-2,-2,134415.45600000001,168,18,{"$f":"OFFSET(Klimadaten!$B$10,$F54,$AK$11)","v":7},27,979.74399999999991,17,20,1023.0540000000001,-2,{"$f":"OFFSET(Klimadaten!$B$10,$F54,$AK$11-1)","v":12},52,-2,{"$f":"OFFSET(Klimadaten!$B$10,$F54,$AK$11+1)","v":5},13,-2,0,0,"",{"$f":"IF(AND(U54=W$28,U53>W$28),(U54-U55)+W$28,U54-U55)","v":0},0,0,null,1023.0540000000001,20,"","",{"$f":"IF(AND(AB54=AE$28,AB53>AE$28),(AB54-AB55)+AE$28,AB54-AB55)","v":7},171.87307200000001,1023.0540000000001,171.87307200000001]
[null,-1,-1,145302.144,192,19,{"$f":"OFFSET(Klimadaten!$B$10,$F55,$AK$11)","v":8},35,936.43399999999997,16,13,1066.364,-1,{"$f":"OFFSET(Klimadaten!$B$10,$F55,$AK$11-1)","v":15},67,-1,{"$f":"OFFSET(Klimadaten!$B$10,$F55,$AK$11+1)","v":5},18,-1,0,0,"",{"$f":"IF(AND(U55=W$28,U54>W$28),(U55-U56)+W$28,U55-U56)","v":0},0,0,null,1066.364,13,"","",{"$f":"IF(AND(AB55=AE$28,AB54>AE$28),(AB55-AB56)+AE$28,AB55-AB56)","v":5},127.96368000000001,1066.364,127.96368]
[null,0,0,205479.93599999999,288,20,{"$f":"OFFSET(Klimadaten!$B$10,$F56,$AK$11)","v":12},47,893.12400000000002,15,8,1109.674,0,{"$f":"OFFSET(Klimadaten!$B$10,$F56,$AK$11-1)","v":18},85,0,{"$f":"OFFSET(Klimadaten!$B$10,$F56,$AK$11+1)","v":7},25,0,0,0,"",0,0,0,null,1109.674,8,"","",5,133.16087999999999,1109.674,133.16087999999999]
[null,1,1,209090.54399999999,312,21,{"$f":"OFFSET(Klimadaten!$B$10,$F57,$AK$11)","v":13},60,849.81400000000008,14,3,1152.9839999999999,1,{"$f":"OFFSET(Klimadaten!$B$10,$F57,$AK$11-1)","v":18},103,1,{"$f":"OFFSET(Klimadaten!$B$10,$F57,$AK$11+1)","v":8},33,1,0,0,"",0,0,0,null,1152.9839999999999,3,"","",2,55.343231999999993,1152.9839999999999,55.343231999999993]
[null,2,2,210622.272,336,22,{"$f":"OFFSET(Klimadaten!$B$10,$F58,$AK$11)","v":14},74,806.50399999999991,13,1,1196.2940000000001,2,{"$f":"OFFSET(Klimadaten!$B$10,$F58,$AK$11-1)","v":15},118,2,{"$f":"OFFSET(Klimadaten!$B$10,$F58,$AK$11+1)","v":9},42,2,0,0,"",0,0,0,null,1196.2940000000001,1,"","",1,28.711056000000003,1196.2940000000001,28.711056000000003]
[null,3,3,238085.136,408,23,{"$f":"OFFSET(Klimadaten!$B$10,$F59,$AK$11)","v":17},91,763.19399999999996,13,1,1196.2940000000001,3,{"$f":"OFFSET(Klimadaten!$B$10,$F59,$AK$11-1)","v":14},132,3,{"$f":"OFFSET(Klimadaten!$B$10,$F59,$AK$11+1)","v":11},53,3,0,0,"",0,0,0,null,1196.2940000000001,1,"","",0,0,1196.2940000000001,0]
[null,4,4,168552.38399999999,312,24,{"$f":"OFFSET(Klimadaten!$B$10,$F60,$AK$11)","v":13},104,719.88400000000001,13,1,1196.2940000000001,4,{"$f":"OFFSET(Klimadaten!$B$10,$F60,$AK$11-1)","v":17},149,4,{"$f":"OFFSET(Klimadaten!$B$10,$F60,$AK$11+1)","v":13},66,4,0,0,"",{"$f":"IF(AND(U60=W$28,U59>W$28),(U60-U61)+W$28,U60-U61)","v":0},0,0,null,1196.2940000000001,1,"","",{"$f":"IF(AND(AB60=AE$28,AB59>AE$28),(AB60-AB61)+AE$28,AB60-AB61)","v":0},0,1196.2940000000001,0]
[null,5,5,143113.53599999999,288,25,{"$f":"OFFSET(Klimadaten!$B$10,$F61,$AK$11)","v":12},116,676.57399999999996,13,1,1196.2940000000001,5,{"$f":"OFFSET(Klimadaten!$B$10,$F61,$AK$11-1)","v":17},166,5,{"$f":"OFFSET(Klimadaten!$B$10,$F61,$AK$11+1)","v":12},78,5,0,0,"",0,0,0,null,1196.2940000000001,1,"","",0,0,1196.2940000000001,0]
[null,6,6,152413.63200000001,336,26,{"$f":"OFFSET(Klimadaten!$B$10,$F62,$AK$11)","v":14},130,633.2639999999999,13,1,1196.2940000000001,6,{"$f":"OFFSET(Klimadaten!$B$10,$F62,$AK$11-1)","v":16},182,6,{"$f":"OFFSET(Klimadaten!$B$10,$F62,$AK$11+1)","v":10},88,6,0,0,"",0,0,0,null,1196.2940000000001,1,"","",0,0,1196.2940000000001,0]
[null,7,7,147708.72,360,27,{"$f":"OFFSET(Klimadaten!$B$10,$F63,$AK$11)","v":15},145,589.95399999999995,13,1,1196.2940000000001,7,{"$f":"OFFSET(Klimadaten!$B$10,$F63,$AK$11-1)","v":17},199,7,{"$f":"OFFSET(Klimadaten!$B$10,$F63,$AK$11+1)","v":13},101,7,0,0,"",0,0,0,null,1196.2940000000001,1,"","",0,0,1196.2940000000001,0]
[null,8,8,123309.31200000001,336,28,{"$f":"OFFSET(Klimadaten!$B$10,$F64,$AK$11)","v":14},159,546.64400000000001,13,1,1196.2940000000001,8,{"$f":"OFFSET(Klimadaten!$B$10,$F64,$AK$11-1)","v":18},217,8,{"$f":"OFFSET(Klimadaten!$B$10,$F64,$AK$11+1)","v":12},113,8,0,0,"",0,0,0,null,1196.2940000000001,1,"","",0,0,1196.2940000000001,0]
[null,9,9,116525.52,360,29,{"$f":"OFFSET(Klimadaten!$B$10,$F65,$AK$11)","v":15},174,503.33399999999995,13,1,1196.2940000000001,9,{"$f":"OFFSET(Klimadaten!$B$10,$F65,$AK$11-1)","v":16},233,9,{"$f":"OFFSET(Klimadaten!$B$10,$F65,$AK$11+1)","v":11},124,9,0,0,"",0,0,0,null,1196.2940000000001,1,"","",0,0,1196.2940000000001,0]
[null,10,10,87476.063999999998,312,30,{"$f":"OFFSET(Klimadaten!$B$10,$F66,$AK$11)","v":13},187,460.02399999999994,13,1,1196.2940000000001,10,{"$f":"OFFSET(Klimadaten!$B$10,$F66,$AK$11-1)","v":16},249,10,{"$f":"OFFSET(Klimadaten!$B$10,$F66,$AK$11+1)","v":13},137,10,0,0,{"$f":"IF(AND(T65=0,T66>0),$K66,\"\")","v":""},0,0,0,null,{"$f":"IF(L66<AB$27,AA65,IF(L66>AB$29,AA65,IF(L66<T$31,T$31,L66)))","v":1196.2940000000001},1,{"$f":"IF(AND(AA65=T$31,AA66>T$31),IF(AB$27<T$31,K65,K66),\"\")","v":""},"",0,0,1196.2940000000001,0]
[null,11,11,73963.343999999997,312,31,{"$f":"OFFSET(Klimadaten!$B$10,$F67,$AK$11)","v":13},200,416.71399999999994,13,1,1196.2940000000001,11,{"$f":"OFFSET(Klimadaten!$B$10,$F67,$AK$11-1)","v":19},268,11,{"$f":"OFFSET(Klimadaten!$B$10,$F67,$AK$11+1)","v":12},149,11,0,{"$f":"IF(AND(T67=0,T68>0),K68,IF(T67=0,U$89,K67))","v":0},"",0,0,0,null,1196.2940000000001,{"$f":"IF(AND(AA67=T$31,AA68>T$31),IF(AB$27<T$31,K67,K68),IF(AA67=T$31,AB$89,K67))","v":1},"","",0,0,1196.2940000000001,0]
[null,12,{"$f":"IF(OR(G68=0,B68>B$6),\"\",B68)","v":12},79050.816000000006,408,32,{"$f":"OFFSET(Klimadaten!$B$10,$F68,$AK$11)","v":17},217,{"$f":"IF(OR($G68=0,$B68>$B$6),-10,$B68*$F$25+$F$24+$L$30)","v":373.40399999999994},13,1,1196.2940000000001,12,{"$f":"OFFSET(Klimadaten!$B$10,$F68,$AK$11-1)","v":15},283,12,{"$f":"OFFSET(Klimadaten!$B$10,$F68,$AK$11+1)","v":12},161,12,0,0,"",0,0,0,null,1196.2940000000001,1,"","",0,0,1196.2940000000001,0]
[null,{"$f":"B68+1","v":13},13,61380.336000000003,408,33,{"$f":"OFFSET(Klimadaten!$B$10,$F69,$AK$11)","v":17},{"$f":"H68+G69","v":234},330.09399999999999,13,1,1196.2940000000001,13,{"$f":"OFFSET(Klimadaten!$B$10,$F69,$AK$11-1)","v":19},302,13,{"$f":"OFFSET(Klimadaten!$B$10,$F69,$AK$11+1)","v":11},172,13,{"$f":"IF(AA$31=0,0,IF(AA$31>=L69,IF(L69>=T68,L69,T68),T68))","v":0},0,"",0,0,0,null,1196.2940000000001,1,"","",0,0,1196.2940000000001,0]
[null,14,14,41138.688000000002,384,34,{"$f":"OFFSET(Klimadaten!$B$10,$F70,$AK$11)","v":16},250,286.78399999999993,13,1,1196.2940000000001,14,{"$f":"OFFSET(Klimadaten!$B$10,$F70,$AK$11-1)","v":18},320,14,{"$f":"OFFSET(Klimadaten!$B$10,$F70,$AK$11+1)","v":12},184,14,0,0,"",0,0,0,null,1196.2940000000001,1,"","",0,0,1196.2940000000001,0]
[null,15,15,24507.648000000001,384,35,{"$f":"OFFSET(Klimadaten!$B$10,$F71,$AK$11)","v":16},266,243.47399999999988,13,1,1196.2940000000001,15,{"$f":"OFFSET(Klimadaten!$B$10,$F71,$AK$11-1)","v":15},335,15,{"$f":"OFFSET(Klimadaten!$B$10,$F71,$AK$11+1)","v":12},196,15,0,0,"",0,0,0,null,1196.2940000000001,1,"","",0,0,1196.2940000000001,0]
[null,16,"","","",36,{"$f":"OFFSET(Klimadaten!$B$10,$F72,$AK$11)","v":16},282,-10,13,1,1196.2940000000001,16,{"$f":"OFFSET(Klimadaten!$B$10,$F72,$AK$11-1)","v":11},346,16,{"$f":"OFFSET(Klimadaten!$B$10,$F72,$AK$11+1)","v":12},208,16,0,0,"",0,0,0,null,1196.2940000000001,1,"","",0,0,1196.2940000000001,0]
[null,17,"","","",37,{"$f":"OFFSET(Klimadaten!$B$10,$F73,$AK$11)","v":17},299,-10,13,1,1196.2940000000001,17,{"$f":"OFFSET(Klimadaten!$B$10,$F73,$AK$11-1)","v":10},356,17,{"$f":"OFFSET(Klimadaten!$B$10,$F73,$AK$11+1)","v":14},222,17,0,0,"",0,0,0,null,1196.2940000000001,1,"","",0,0,1196.2940000000001,0]
[null,18,"","","",38,{"$f":"OFFSET(Klimadaten!$B$10,$F74,$AK$11)","v":16},315,-10,13,1,1196.2940000000001,18,{"$f":"OFFSET(Klimadaten!$B$10,$F74,$AK$11-1)","v":6},362,18,{"$f":"OFFSET(Klimadaten!$B$10,$F74,$AK$11+1)","v":16},238,18,0,0,"",0,0,0,null,1196.2940000000001,1,"","",0,0,1196.2940000000001,0]
[null,19,"","","",39,{"$f":"OFFSET(Klimadaten!$B$10,$F75,$AK$11)","v":10},325,-10,13,1,1196.2940000000001,19,{"$f":"OFFSET(Klimadaten!$B$10,$F75,$AK$11-1)","v":3},365,19,{"$f":"OFFSET(Klimadaten!$B$10,$F75,$AK$11+1)","v":14},252,19,0,0,"",0,0,0,null,1196.2940000000001,1,"","",0,0,1196.2940000000001,0]
[null,20,"","","",40,{"$f":"OFFSET(Klimadaten!$B$10,$F76,$AK$11)","v":12},337,-10,13,1,1196.2940000000001,20,{"$f":"OFFSET(Klimadaten!$B$10,$F76,$AK$11-1)","v":0},365,-25,{"$f":"OFFSET(Klimadaten!$B$10,$F76,$AK$11+1)","v":13},265,20,0,0,"",0,0,0,null,1196.2940000000001,1,"","",0,0,1196.2940000000001,0]
[null,21,"","","",41,{"$f":"OFFSET(Klimadaten!$B$10,$F77,$AK$11)","v":10},347,-10,13,1,1196.2940000000001,21,{"$f":"OFFSET(Klimadaten!$B$10,$F77,$AK$11-1)","v":0},365,-25,{"$f":"OFFSET(Klimadaten!$B$10,$F77,$AK$11+1)","v":14},279,21,0,0,"",0,0,0,null,1196.2940000000001,1,"","",0,0,1196.2940000000001,0]
[null,22,"","","",42,{"$f":"OFFSET(Klimadaten!$B$10,$F78,$AK$11)","v":7},354,-10,13,1,1196.2940000000001,22,{"$f":"OFFSET(Klimadaten!$B$10,$F78,$AK$11-1)","v":0},365,-25,{"$f":"OFFSET(Klimadaten!$B$10,$F78,$AK$11+1)","v":12},291,22,0,0,"",0,0,0,null,1196.2940000000001,1,"","",0,0,1196.2940000000001,0]
[null,23,"","","",43,{"$f":"OFFSET(Klimadaten!$B$10,$F79,$AK$11)","v":5},359,-10,13,1,1196.2940000000001,23,{"$f":"OFFSET(Klimadaten!$B$10,$F79,$AK$11-1)","v":0},365,-25,{"$f":"OFFSET(Klimadaten!$B$10,$F79,$AK$11+1)","v":14},305,23,0,0,"",0,0,0,null,1196.2940000000001,1,"","",0,0,1196.2940000000001,0]
[null,24,"","","",44,{"$f":"OFFSET(Klimadaten!$B$10,$F80,$AK$11)","v":3},362,-10,13,1,1196.2940000000001,24,{"$f":"OFFSET(Klimadaten!$B$10,$F80,$AK$11-1)","v":0},365,-25,{"$f":"OFFSET(Klimadaten!$B$10,$F80,$AK$11+1)","v":10},315,24,0,0,"",0,0,0,null,1196.2940000000001,1,"","",0,0,1196.2940000000001,0]
[null,25,"","","",45,{"$f":"OFFSET(Klimadaten!$B$10,$F81,$AK$11)","v":2},364,-10,13,1,1196.2940000000001,25,{"$f":"OFFSET(Klimadaten!$B$10,$F81,$AK$11-1)","v":0},365,-25,{"$f":"OFFSET(Klimadaten!$B$10,$F81,$AK$11+1)","v":11},326,25,0,0,"",0,0,0,null,1196.2940000000001,1,"","",0,0,1196.2940000000001,0]
[null,26,"","","",46,{"$f":"OFFSET(Klimadaten!$B$10,$F82,$AK$11)","v":1},365,-10,13,1,1196.2940000000001,26,{"$f":"OFFSET(Klimadaten!$B$10,$F82,$AK$11-1)","v":0},365,-25,{"$f":"OFFSET(Klimadaten!$B$10,$F82,$AK$11+1)","v":9},335,26,0,0,"",0,0,0,null,1196.2940000000001,1,"","",0,0,1196.2940000000001,0]
[null,27,"","","",47,{"$f":"OFFSET(Klimadaten!$B$10,$F83,$AK$11)","v":0},365,-10,13,1,1196.2940000000001,-25,{"$f":"OFFSET(Klimadaten!$B$10,$F83,$AK$11-1)","v":0},365,-25,{"$f":"OFFSET(Klimadaten!$B$10,$F83,$AK$11+1)","v":8},343,27,0,0,"",0,0,0,null,1196.2940000000001,1,"","",0,0,1196.2940000000001,0]
[null,28,"","","",48,{"$f":"OFFSET(Klimadaten!$B$10,$F84,$AK$11)","v":0},365,-10,13,1,1196.2940000000001,-25,{"$f":"OFFSET(Klimadaten!$B$10,$F84,$AK$11-1)","v":0},365,-25,{"$f":"OFFSET(Klimadaten!$B$10,$F84,$AK$11+1)","v":6},349,28,0,0,"",0,0,0,null,1196.2940000000001,1,"","",0,0,1196.2940000000001,0]
[null,29,"","","",49,{"$f":"OFFSET(Klimadaten!$B$10,$F85,$AK$11)","v":0},365,-10,13,1,1196.2940000000001,-25,{"$f":"OFFSET(Klimadaten!$B$10,$F85,$AK$11-1)","v":0},365,-25,{"$f":"OFFSET(Klimadaten!$B$10,$F85,$AK$11+1)","v":6},355,29,0,0,"",0,0,0,null,1196.2940000000001,1,"","",0,0,1196.2940000000001,0]
[null,30,"","","",50,{"$f":"OFFSET(Klimadaten!$B$10,$F86,$AK$11)","v":0},365,-10,13,1,1196.2940000000001,-25,{"$f":"OFFSET(Klimadaten!$B$10,$F86,$AK$11-1)","v":0},365,-25,{"$f":"OFFSET(Klimadaten!$B$10,$F86,$AK$11+1)","v":10},365,30,0,0,"",{"$f":"IF(AND(U86=1,U85>1),(U86),U86-W$28)","v":-1},0,0,null,1196.2940000000001,1,"","",{"$f":"IF(AND(AB86=1,AB85>1),(AB86),AB86-AE$28)","v":0},0,1196.2940000000001,0]
[null,null,null,null,null,null,null,null,null,null,null,null,null,null,null,null,null,null,null,0,0,"",null,null,0,null,{"$f":"AA86","v":1196.2940000000001},0,"","",null,null,1196.2940000000001]
[null,null,null,null,null,null,null,null,null,null,null,null,null,null,null,null,null,null,null,0,0,null,null,null,null,null,{"$f":"T$31","v":0},0]
[null,null,null,null,null,null,null,null,null,null,null,null,null,null,null,null,null,null,null,0,{"$f":"MAX(V34:V87)","v":0},null,null,null,null,null,{"$f":"T$31","v":0},{"$f":"MAX(AC34:AC87)","v":365}]

{"sheet":"Klimadaten","index":10,"n_rows":60,"n_cols":273,"rows_kept":60,"cut":false,"hidden":true,"merged":[]}
[null,null,null,{"$f":"SUM(D10:D60)","v":365},null,null,null,{"$f":"SUM(H10:H60)","v":365},null,null,null,{"$f":"SUM(L10:L60)","v":365},null,null,null,{"$f":"SUM(P10:P60)","v":365},null,null,null,{"$f":"SUM(T10:T60)","v":365},null,null,null,{"$f":"SUM(X10:X60)","v":365},null,null,null,{"$f":"SUM(AB10:AB60)","v":365},null,null,null,{"$f":"SUM(AF10:AF60)","v":365},null,null,null,{"$f":"SUM(AJ10:AJ60)","v":365},null,null,null,{"$f":"SUM(AN10:AN60)","v":365},null,null,null,{"$f":"SUM(AR10:AR60)","v":365},null,null,null,{"$f":"SUM(AV10:AV60)","v":365},null,null,null,{"$f":"SUM(AZ10:AZ60)","v":365},null,null,null,{"$f":"SUM(BD10:BD60)","v":365},null,null,null,{"$f":"SUM(BH10:BH60)","v":365},null,null,null,{"$f":"SUM(BL10:BL60)","v":365},null,null,null,{"$f":"SUM(BP10:BP60)","v":365},null,null,null,{"$f":"SUM(BT10:BT60)","v":365},null,null,null,{"$f":"SUM(BX10:BX60)","v":365},null,null,null,{"$f":"SUM(CB10:CB60)","v":365},null,null,null,{"$f":"SUM(CF10:CF60)","v":365},null,null,null,{"$f":"SUM(CJ10:CJ60)","v":365},null,null,null,{"$f":"SUM(CN10:CN60)","v":365},null,null,null,{"$f":"SUM(CR10:CR60)","v":365},null,null,null,{"$f":"SUM(CV10:CV60)","v":365},null,null,null,{"$f":"SUM(CZ10:CZ60)","v":365},null,null,null,{"$f":"SUM(DD10:DD60)","v":365},null,null,null,{"$f":"SUM(DH10:DH60)","v":365},null,null,null,{"$f":"SUM(DL10:DL60)","v":365},null,null,null,{"$f":"SUM(DP10:DP60)","v":365},null,null,null,{"$f":"SUM(DT10:DT60)","v":365},null,null,null,{"$f":"SUM(DX10:DX60)","v":365},null,null,null,{"$f":"SUM(EB10:EB60)","v":365},null,null,null,{"$f":"SUM(EF10:EF60)","v":365},null,null,null,{"$f":"SUM(EJ10:EJ60)","v":365},null,null,null,{"$f":"SUM(EN10:EN60)","v":365},null,null,null,{"$f":"SUM(ER10:ER60)","v":365},null,null,null,{"$f":"SUM(EV10:EV60)","v":365},null,null,null,{"$f":"SUM(EZ10:EZ60)","v":365},null,null,null,{"$f":"SUM(FD10:FD60)","v":365},null,null,null,{"$f":"SUM(FH10:FH60)","v":365},null,null,null,{"$f":"SUM(FL10:FL60)","v":365},null,null,null,{"$f":"SUM(FP10:FP60)","v":365},null,null,null,{"$f":"SUM(FT10:FT60)","v":365},null,null,null,{"$f":"SUM(FX10:FX60)","v":365},null,null,null,{"$f":"SUM(GB10:GB60)","v":365},null,null,null,{"$f":"SUM(GF10:GF60)","v":365},null,null,null,{"$f":"SUM(GJ10:GJ60)","v":365},null,null,null,{"$f":"SUM(GN10:GN60)","v":365},null,null,null,{"$f":"SUM(GR10:GR60)","v":365},null,null,null,{"$f":"SUM(GV10:GV60)","v":365},null,null,null,{"$f":"SUM(GZ10:GZ60)","v":365},null,null,null,{"$f":"SUM(HD10:HD60)","v":365},null,null,null,{"$f":"SUM(HH10:HH60)","v":365},null,null,null,{"$f":"SUM(HL10:HL60)","v":365},null,null,null,{"$f":"SUM(HP10:HP60)","v":365},null,null,null,{"$f":"SUM(HT10:HT60)","v":365},null,null,null,{"$f":"SUM(HX10:HX60)","v":365},null,null,null,{"$f":"SUM(IB10:IB60)","v":365},null,null,null,{"$f":"SUM(IF10:IF60)","v":365},null,null,null,{"$f":"SUM(IJ10:IJ60)","v":365},null,null,null,{"$f":"SUM(IN10:IN60)","v":365},null,null,null,{"$f":"SUM(IR10:IR60)","v":365},null,null,null,{"$f":"SUM(IV10:IV60)","v":365},null,null,null,{"$f":"SUM(IZ10:IZ60)","v":365},null,null,null,{"$f":"SUM(JD10:JD60)","v":365},null,null,null,{"$f":"SUM(JH10:JH60)","v":365},null,null,null,{"$f":"SUM(JL10:JL60)","v":365}]
[]
[null,null,"Davos (CH)",null,null,null,"Zürich/Fluntern (CH)",null,null,null,"Locarno/Monti (CH)",null,null,null,"Graz Universität (AT)",null,null,null,"Tamsweg (AT)",null,null,null,"Wien innere Stadt (AT)",null,null,null,"Karlsruhe/Rheinstetten (DE)",null,null,null,"München Flughafen (DE)",null,null,null,"Hohenpeißenberg (DE)",null,null,null,"BRNIK LETALIŠČE (SI)",null,null,null,"BILJE (SI)",null,null,null,"NOVA VAS, BLOKE (SI)",null,null,null,"Frankfurt/Main Flughafen (DE)",null,null,null,"Trier-Petrisberg (DE)",null,null,null,"Kahler Asten (DE)",null,null,null,"Augsburg (DE)",null,null,null,"Bamberg (DE)",null,null,null,"Hof (DE)",null,null,null,"Kempten (DE)",null,null,null,"Nürnberg (DE)",null,null,null,"Würzburg (DE)",null,null,null,"Basel-Binningen (CH)",null,null,null,"Bern/Zollikofen (CH)",null,null,null,"La Chaux-de-Fonds (CH)",null,null,null,"Engelberg (CH)",null,null,null,"Luzern (CH)",null,null,null,"Pully (CH)",null,null,null,"Samedan (CH)",null,null,null,"St. Gallen (CH)",null,null,null,"Visp (CH)",null,null,null,"Bad Aussee (AT)",null,null,null,"Bregenz (AT)",null,null,null,"Eisenstadt (AT)",null,null,null,"Freistadt (AT)",null,null,null,"Fürstenfeld (AT)",null,null,null,"Hohenau/March (AT)",null,null,null,"Innsbruck Universität (AT)",null,null,null,"Klagenfurt Flughafen (AT)",null,null,null,"Kufstein (AT)",null,null,null,"Lienz (AT)",null,null,null,"Linz Stadt (AT)",null,null,null,"Mariazell (AT)",null,null,null,"Salzburg-Freisaal (AT)",null,null,null,"Schröcken (AT)",null,null,null,"St. Pölten (AT)",null,null,null,"Zell am See (AT)",null,null,null,"Zeltweg (AT)",null,null,null,"Andermatt (CH)",null,null,null,"Acquarossa/Comprovasco (CH)",null,null,null,"Bad Ragaz (CH)",null,null,null,"Château-d'Oex (CH)",null,null,null,"Disentis/Sedrun (CH)",null,null,null,"Fribourg/Posieux (CH)",null,null,null,"Piotta (CH)",null,null,null,"Ulrichen (CH)",null,null,null,"Barcis (IT)",null,null,null,"Codroipo (IT)",null,null,null,"Forni di Sopra (IT)",null,null,null,"Gemona (IT)",null,null,null,"San Pietro al Nasitone (IT)",null,null,null,"Sgonico (IT)",null,null,null,"Tarvisio (IT)",null,null,null,"Tolmezzo (IT)",null,null,null,"Bullet / La Fretaz (CH)",null,null,null,"Einsiedeln (CH)",null,null,null,"Langnau i.E. (CH)",null,null,null,"Payerne (CH)",null,null,null,"Rünenberg (CH)"]
[null,null,"10 Jahresmittel",null,null,null,"10 Jahresmittel",null,null,null,"10 Jahresmittel",null,null,null,"Steiermark",null,null,null,"Salzburg",null,null,null,"WIEN INNERE STADT",null,null,null,"10 Jahresmittel",null,null,null,"10 Jahresmittel",null,null,null,"10 Jahresmittel",null,null,null,"10 Jahresmittel",null,null,null,"10 Jahresmittel",null,null,null,"10 Jahresmittel",null,null,null,"10 Jahresmittel",null,null,null,"10 Jahresmittel",null,null,null,"10 Jahresmittel",null,null,null,"10 Jahresmittel",null,null,null,"10 Jahresmittel",null,null,null,"10 Jahresmittel",null,null,null,"10 Jahresmittel",null,null,null,"10 Jahresmittel",null,null,null,"10 Jahresmittel",null,null,null,"10 Jahresmittel",null,null,null,"10 Jahresmittel",null,null,null,"10 Jahresmittel",null,null,null,"10 Jahresmittel",null,null,null,"10 Jahresmittel",null,null,null,"10 Jahresmittel",null,null,null,"10 Jahresmittel",null,null,null,"10 Jahresmittel",null,null,null,"10 Jahresmittel",null,null,null,"10 Jahresmittel",null,null,null,"10 Jahresmittel",null,null,null,"10 Jahresmittel",null,null,null,"10 Jahresmittel",null,null,null,"10 Jahresmittel",null,null,null,"10 Jahresmittel",null,null,null,"10 Jahresmittel",null,null,null,"10 Jahresmittel",null,null,null,"10 Jahresmittel",null,null,null,"10 Jahresmittel",null,null,null,"10 Jahresmittel",null,null,null,"10 Jahresmittel",null,null,null,"10 Jahresmittel",null,null,null,"10 Jahresmittel",null,null,null,"10 Jahresmittel",null,null,null,"10 Jahresmittel",null,null,null,"10 Jahresmittel",null,null,null,"10 Jahresmittel",null,null,null,"10 Jahresmittel",null,null,null,"10 Jahresmittel",null,null,null,"10 Jahresmittel",null,null,null,"10 Jahresmittel",null,null,null,"10 Jahresmittel",null,null,null,"10 Jahresmittel",null,null,null,"10 Jahresmittel",null,null,null,"10 Jahresmittel",null,null,null,"10 Jahresmittel",null,null,null,"10 Jahresmittel",null,null,null,"10 Jahresmittel",null,null,null,"10 Jahresmittel",null,null,null,"10 Jahresmittel",null,null,null,"10 Jahresmittel",null,null,null,"10 Jahresmittel",null,null,null,"10 Jahresmittel",null,null,null,"10 Jahresmittel",null,null,null,"10 Jahresmittel",null,null,null,"10 Jahresmittel",null,null,null,"10 Jahresmittel"]
[null,null,"2002-2011",null,null,null,"2002-2011",null,null,null,"2002-2011",null,null,null,"2002-2011",null,null,null,"2002-2011",null,null,null,"2002-2011",null,null,null,"2002-2011",null,null,null,"2002-2011",null,null,null,"2002-2011",null,null,null,"1993-2002",null,null,null,"1993-2002",null,null,null,"1993-2002",null,null,null,"2002-2011",null,null,null,"2002-2011",null,null,null,"2002-2011",null,null,null,"2002-2011",null,null,null,"2002-2011",null,null,null,"2002-2011",null,null,null,"2002-2011",null,null,null,"2002-2011",null,null,null,"2002-2011",null,null,null,"2002-2011",null,null,null,"2002-2011",null,null,null,"2002-2011",null,null,null,"2002-2011",null,null,null,"2002-2011",null,null,null,"2002-2011",null,null,null,"2002-2011",null,null,null,"2002-2011",null,null,null,"2002-2011",null,null,null,"2002-2011",null,null,null,"2002-2011",null,null,null,"2002-2011",null,null,null,"2002-2011",null,null,null,"2002-2011",null,null,null,"2002-2011",null,null,null,"2002-2011",null,null,null,"2002-2011",null,null,null,"2002-2011",null,null,null,"2002-2011",null,null,null,"2002-2011",null,null,null,"2002-2011",null,null,null,"2002-2011",null,null,null,"2002-2011",null,null,null,"2002-2011",null,null,null,"2002-2011",null,null,null,"2002-2011",null,null,null,"2002-2011",null,null,null,"2002-2011",null,null,null,"2002-2011",null,null,null,"2002-2011",null,null,null,"2002-2011",null,null,null,"2002-2011",null,null,null,"2002-2011",null,null,null,"2002-2011",null,null,null,"(2011-2020)",null,null,null,"(2011-2020)",null,null,null,"(2011-2020)",null,null,null,"(2011-2020)",null,null,null,"(2011-2020)",null,null,null,"(2011-2020)",null,null,null,"(2011-2020)",null,null,null,"(2011-2020)",null,null,null,"2002-2011",null,null,null,"2002-2011",null,null,null,"2002-2011",null,null,null,"2002-2011",null,null,null,"2002-2011"]
[null,null,"Häufigkeit",null,null,null,"Häufigkeit",null,null,null,"Häufigkeit",null,null,null,"Häufigkeit",null,null,null,"Häufigkeit",null,null,null,"Häufigkeit",null,null,null,"Häufigkeit",null,null,null,"Häufigkeit",null,null,null,"Häufigkeit",null,null,null,"Häufigkeit",null,null,null,"Häufigkeit",null,null,null,"Häufigkeit",null,null,null,"Häufigkeit",null,null,null,"Häufigkeit",null,null,null,"Häufigkeit",null,null,null,"Häufigkeit",null,null,null,"Häufigkeit",null,null,null,"Häufigkeit",null,null,null,"Häufigkeit",null,null,null,"Häufigkeit",null,null,null,"Häufigkeit",null,null,null,"Häufigkeit",null,null,null,"Häufigkeit",null,null,null,"Häufigkeit",null,null,null,"Häufigkeit",null,null,null,"Häufigkeit",null,null,null,"Häufigkeit",null,null,null,"Häufigkeit",null,null,null,"Häufigkeit",null,null,null,"Häufigkeit",null,null,null,"Häufigkeit",null,null,null,"Häufigkeit",null,null,null,"Häufigkeit",null,null,null,"Häufigkeit",null,null,null,"Häufigkeit",null,null,null,"Häufigkeit",null,null,null,"Häufigkeit",null,null,null,"Häufigkeit",null,null,null,"Häufigkeit",null,null,null,"Häufigkeit",null,null,null,"Häufigkeit",null,null,null,"Häufigkeit",null,null,null,"Häufigkeit",null,null,null,"Häufigkeit",null,null,null,"Häufigkeit",null,null,null,"Häufigkeit",null,null,null,"Häufigkeit",null,null,null,"Häufigkeit",null,null,null,"Häufigkeit",null,null,null,"Häufigkeit",null,null,null,"Häufigkeit",null,null,null,"Häufigkeit",null,null,null,"Häufigkeit",null,null,null,"Häufigkeit",null,null,null,"Häufigkeit",null,null,null,"Häufigkeit",null,null,null,"Häufigkeit",null,null,null,"Häufigkeit",null,null,null,"Häufigkeit",null,null,null,"Häufigkeit",null,null,null,"Häufigkeit",null,null,null,"Häufigkeit",null,null,null,"Häufigkeit",null,null,null,"Häufigkeit",null,null,null,"Häufigkeit",null,null,null,"Häufigkeit",null,null,null,"Häufigkeit",null,null,null,"Häufigkeit"]
[null,null,"Min.","Mittel","Max.",null,"Min.","Mittel","Max.",null,"Min.","Mittel","Max.",null,"Min.","Mittel","Max.",null,"Min.","Mittel","Max.",null,"Min.","Mittel","Max.",null,"Min.","Mittel","Max.",null,"Min.","Mittel","Max.",null,"Min.","Mittel","Max.",null,"Min.","Mittel","Max.",null,"Min.","Mittel","Max.",null,"Min.","Mittel","Max.",null,"Min.","Mittel","Max.",null,"Min.","Mittel","Max.",null,"Min.","Mittel","Max.",null,"Min.","Mittel","Max.",null,"Min.","Mittel","Max.",null,"Min.","Mittel","Max.",null,"Min.","Mittel","Max.",null,"Min.","Mittel","Max.",null,"Min.","Mittel","Max.",null,"Min.","Mittel","Max.",null,"Min.","Mittel","Max.",null,"Min.","Mittel","Max.",null,"Min.","Mittel","Max.",null,"Min.","Mittel","Max.",null,"Min.","Mittel","Max.",null,"Min.","Mittel","Max.",null,"Min.","Mittel","Max.",null,"Min.","Mittel","Max.",null,"Min.","Mittel","Max.",null,"Min.","Mittel","Max.",null,"Min.","Mittel","Max.",null,"Min.","Mittel","Max.",null,"Min.","Mittel","Max.",null,"Min.","Mittel","Max.",null,"Min.","Mittel","Max.",null,"Min.","Mittel","Max.",null,"Min.","Mittel","Max.",null,"Min.","Mittel","Max.",null,"Min.","Mittel","Max.",null,"Min.","Mittel","Max.",null,"Min.","Mittel","Max.",null,"Min.","Mittel","Max.",null,"Min.","Mittel","Max.",null,"Min.","Mittel","Max.",null,"Min.","Mittel","Max.",null,"Min.","Mittel","Max.",null,"Min.","Mittel","Max.",null,"Min.","Mittel","Max.",null,"Min.","Mittel","Max.",null,"Min.","Mittel","Max.",null,"Min.","Mittel","Max.",null,"Min.","Mittel","Max.",null,"Min.","Mittel","Max.",null,"Min.","Mittel","Max.",null,"Min.","Mittel","Max.",null,"Min.","Mittel","Max.",null,"Min.","Mittel","Max.",null,"Min.","Mittel","Max.",null,"Min.","Mittel","Max.",null,"Min.","Mittel","Max.",null,"Min.","Mittel","Max.",null,"Min.","Mittel","Max.",null,"Min.","Mittel","Max.",null,"Min.","Mittel","Max.",null,"Min.","Mittel","Max.",null,"Min.","Mittel","Max."]
[null,0,{"$f":"B8+1","v":1},{"$f":"C8+1","v":2},3,4,5,6,7,8,9,10,11,12,13,14,15,16,17,18,19,20,21,22,23,24,25,26,27,28,29,30,31,32,33,34,35,36,37,38,39,40,41,42,43,44,45,46,47,48,49,50,51,52,53,54,55,56,57,58,59,60,61,62,63,64,65,{"$f":"BO8+1","v":66},67,68,69,70,71,72,73,74,75,76,77,78,79,80,81,82,83,84,85,86,87,88,89,90,91,92,93,94,95,96,97,98,99,100,101,102,103,104,105,106,107,108,109,110,111,112,113,114,115,116,117,118,119,120,121,122,123,124,125,126,127,128,129,{"$f":"EA8+1","v":130},131,132,133,134,135,136,137,138,139,140,141,142,143,144,145,146,147,148,149,150,151,152,153,154,155,156,157,158,159,160,161,162,163,164,165,166,167,168,169,170,171,172,173,174,175,176,177,178,179,180,181,182,183,184,185,186,187,188,189,190,191,192,193,{"$f":"GM8+1","v":194},195,196,197,198,199,200,201,202,203,204,205,206,207,208,209,210,211,212,213,214,215,216,217,218,219,{"$f":"HM8+1","v":220},{"$f":"HN8+1","v":221},{"$f":"HO8+1","v":222},{"$f":"HP8+1","v":223},{"$f":"HQ8+1","v":224},{"$f":"HR8+1","v":225},{"$f":"HS8+1","v":226},{"$f":"HT8+1","v":227},{"$f":"HU8+1","v":228},{"$f":"HV8+1","v":229},{"$f":"HW8+1","v":230},{"$f":"HX8+1","v":231},{"$f":"HY8+1","v":232},{"$f":"HZ8+1","v":233},{"$f":"IA8+1","v":234},{"$f":"IB8+1","v":235},{"$f":"IC8+1","v":236},{"$f":"ID8+1","v":237},{"$f":"IE8+1","v":238},{"$f":"IF8+1","v":239},{"$f":"IG8+1","v":240},{"$f":"IH8+1","v":241},{"$f":"II8+1","v":242},{"$f":"IJ8+1","v":243},{"$f":"IK8+1","v":244},{"$f":"IL8+1","v":245},{"$f":"IM8+1","v":246},{"$f":"IN8+1","v":247},{"$f":"IO8+1","v":248},{"$f":"IP8+1","v":249},{"$f":"IQ8+1","v":250},{"$f":"IR8+1","v":251},{"$f":"IS8+1","v":252},{"$f":"IT8+1","v":253},{"$f":"IU8+1","v":254},{"$f":"IV8+1","v":255},{"$f":"IW8+1","v":256},{"$f":"IX8+1","v":257},{"$f":"IY8+1","v":258},{"$f":"IZ8+1","v":259},{"$f":"JA8+1","v":260},{"$f":"JB8+1","v":261},{"$f":"JC8+1","v":262},{"$f":"JD8+1","v":263},{"$f":"JE8+1","v":264},{"$f":"JF8+1","v":265},{"$f":"JG8+1","v":266},{"$f":"JH8+1","v":267},{"$f":"JI8+1","v":268},{"$f":"JJ8+1","v":269},{"$f":"JK8+1","v":270},{"$f":"JL8+1","v":271}]
[]
[-20,null,1,0,0,null,0,0,0,null,0,0,0,null,0,0,0,null,2,0,0,null,0,0,0,null,0,0,0,null,0,0,0,null,0,0,0,null,0,0,0,null,0,0,0,null,1,0,0,null,0,0,0,null,0,0,0,null,0,0,0,null,0,0,0,null,0,0,0,null,0,0,0,null,0,0,0,null,0,0,0,null,0,0,0,null,0,0,0,null,0,0,0,null,0,0,0,null,0,0,0,null,0,0,0,null,0,0,0,null,32,1,0,null,0,0,0,null,0,0,0,null,0,0,0,null,0,0,0,null,0,0,0,null,0,0,0,null,0,0,0,null,0,0,0,null,0,0,0,null,0,0,0,null,0,0,0,null,0,0,0,null,0,0,0,null,1,0,0,null,0,0,0,null,0,0,0,null,0,0,0,null,0,0,0,null,1,0,0,null,1,0,0,null,0,0,0,null,0,0,0,null,0,0,0,null,0,0,0,null,0,0,0,null,0,0,0,null,17,0,0,null,0,0,0,null,0,0,0,null,0,0,0,null,0,0,0,null,0,0,0,null,0,0,0,null,0,0,0,null,0,0,0,null,0,0,0,null,0,0,0,null,0,0,0,null,0,0,0,null,0,0,0]
[-19,null,0,0,0,null,0,0,0,null,0,0,0,null,0,0,0,null,2,0,0,null,0,0,0,null,0,0,0,null,0,0,0,null,0,0,0,null,0,0,0,null,0,0,0,null,1,0,0,null,0,0,0,null,0,0,0,null,0,0,0,null,0,0,0,null,0,0,0,null,0,0,0,null,0,0,0,null,0,0,0,null,0,0,0,null,0,0,0,null,0,0,0,null,1,0,0,null,0,0,0,null,0,0,0,null,0,0,0,null,6,1,0,null,0,0,0,null,0,0,0,null,0,0,0,null,0,0,0,null,0,0,0,null,1,0,0,null,0,0,0,null,0,0,0,null,0,0,0,null,0,0,0,null,0,0,0,null,0,0,0,null,0,0,0,null,1,0,0,null,0,0,0,null,0,0,0,null,0,0,0,null,0,0,0,null,1,0,0,null,1,0,0,null,0,0,0,null,0,0,0,null,0,0,0,null,0,0,0,null,0,0,0,null,0,0,0,null,4,1,0,null,0,0,0,null,0,0,0,null,0,0,0,null,0,0,0,null,0,0,0,null,0,0,0,null,0,0,0,null,0,0,0,null,0,0,0,null,0,0,0,null,0,0,0,null,0,0,0,null,0,0,0]
[-18,null,2,0,0,null,0,0,0,null,0,0,0,null,0,0,0,null,2,0,0,null,0,0,0,null,0,0,0,null,0,0,0,null,0,0,0,null,0,0,0,null,0,0,0,null,0,0,0,null,0,0,0,null,0,0,0,null,0,0,0,null,0,0,0,null,0,0,0,null,0,0,0,null,1,0,0,null,0,0,0,null,0,0,0,null,0,0,0,null,0,0,0,null,1,0,0,null,0,0,0,null,0,0,0,null,0,0,0,null,6,1,0,null,0,0,0,null,0,0,0,null,0,0,0,null,0,0,0,null,0,0,0,null,1,0,0,null,0,0,0,null,0,0,0,null,0,0,0,null,0,0,0,null,0,0,0,null,1,0,0,null,0,0,0,null,0,0,0,null,0,0,0,null,0,0,0,null,0,0,0,null,0,0,0,null,1,0,0,null,1,0,0,null,0,0,0,null,0,0,0,null,0,0,0,null,0,0,0,null,0,0,0,null,0,0,0,null,4,1,0,null,0,0,0,null,0,0,0,null,0,0,0,null,0,0,0,null,0,0,0,null,0,0,0,null,0,0,0,null,0,0,0,null,0,0,0,null,1,0,0,null,0,0,0,null,0,0,0,null,0,0,0]
[-17,null,3,0,0,null,0,0,0,null,0,0,0,null,0,0,0,null,2,0,0,null,0,0,0,null,0,0,0,null,1,0,0,null,0,0,0,null,1,0,0,null,0,0,0,null,1,0,0,null,0,0,0,null,0,0,0,null,0,0,0,null,1,0,0,null,0,0,0,null,0,0,0,null,1,0,0,null,0,0,0,null,0,0,0,null,0,0,0,null,0,0,0,null,1,0,0,null,0,0,0,null,0,0,0,null,0,0,0,null,6,2,0,null,0,0,0,null,1,0,0,null,1,0,0,null,0,0,0,null,0,0,0,null,1,0,0,null,0,0,0,null,1,0,0,null,0,0,0,null,0,0,0,null,0,0,0,null,1,0,0,null,0,0,0,null,1,0,0,null,0,0,0,null,1,0,0,null,0,0,0,null,1,0,0,null,2,0,0,null,3,0,0,null,0,0,0,null,0,0,0,null,1,0,0,null,0,0,0,null,0,0,0,null,0,0,0,null,7,1,0,null,0,0,0,null,0,0,0,null,0,0,0,null,0,0,0,null,0,0,0,null,0,0,0,null,0,0,0,null,0,0,0,null,0,0,0,null,0,0,0,null,0,0,0,null,0,0,0,null,0,0,0]
[-16,null,4,0,0,null,0,0,0,null,0,0,0,null,0,0,0,null,3,1,0,null,0,0,0,null,0,0,0,null,1,0,0,null,0,0,0,null,1,0,0,null,0,0,0,null,1,0,0,null,0,0,0,null,0,0,0,null,0,0,0,null,1,0,0,null,1,0,0,null,1,0,0,null,2,0,0,null,0,0,0,null,0,0,0,null,0,0,0,null,0,0,0,null,2,0,0,null,1,0,0,null,0,0,0,null,0,0,0,null,7,2,0,null,0,0,0,null,1,0,0,null,1,0,0,null,0,0,0,null,0,0,0,null,0,0,0,null,1,0,0,null,1,0,0,null,0,0,0,null,1,0,0,null,0,0,0,null,1,0,0,null,0,0,0,null,2,0,0,null,0,0,0,null,1,0,0,null,0,0,0,null,0,0,0,null,2,0,0,null,3,1,0,null,0,0,0,null,0,0,0,null,0,0,0,null,0,0,0,null,0,0,0,null,0,0,0,null,5,2,0,null,0,0,0,null,0,0,0,null,0,0,0,null,0,0,0,null,0,0,0,null,0,0,0,null,0,0,0,null,0,0,0,null,0,0,0,null,2,0,0,null,0,0,0,null,0,0,0,null,0,0,0]
[-15,null,3,0,0,null,0,0,0,null,0,0,0,null,0,0,0,null,3,1,0,null,0,0,0,null,0,0,0,null,1,0,0,null,0,0,0,null,0,0,0,null,0,0,0,null,3,0,0,null,0,0,0,null,0,0,0,null,0,0,0,null,0,0,0,null,1,0,0,null,1,0,0,null,1,0,0,null,1,0,0,null,0,0,0,null,0,0,0,null,0,0,0,null,4,0,0,null,2,0,0,null,0,0,0,null,0,0,0,null,7,4,0,null,0,0,0,null,1,0,0,null,1,0,0,null,0,0,0,null,0,0,0,null,2,0,0,null,1,0,0,null,1,0,0,null,0,0,0,null,1,0,0,null,0,0,0,null,3,0,0,null,0,0,0,null,2,0,0,null,1,0,0,null,2,0,0,null,0,0,0,null,1,0,0,null,4,1,0,null,3,1,0,null,0,0,0,null,0,0,0,null,2,0,0,null,0,0,0,null,0,0,0,null,0,0,0,null,6,2,0,null,0,0,0,null,0,0,0,null,0,0,0,null,0,0,0,null,0,0,0,null,0,0,0,null,1,0,0,null,0,0,0,null,0,0,0,null,2,0,0,null,0,0,0,null,0,0,0,null,0,0,0]
[-14,null,5,1,0,null,0,0,0,null,0,0,0,null,0,0,0,null,4,1,0,null,0,0,0,null,0,0,0,null,2,0,0,null,0,0,0,null,1,0,0,null,0,0,0,null,2,0,0,null,0,0,0,null,0,0,0,null,1,0,0,null,1,0,0,null,1,0,0,null,2,0,0,null,3,0,0,null,1,0,0,null,1,0,0,null,0,0,0,null,0,0,0,null,2,0,0,null,2,0,0,null,0,0,0,null,0,0,0,null,7,4,0,null,0,0,0,null,2,0,0,null,1,0,0,null,0,0,0,null,0,0,0,null,2,0,0,null,0,0,0,null,1,0,0,null,0,0,0,null,1,0,0,null,1,0,0,null,3,0,0,null,0,0,0,null,2,1,0,null,1,0,0,null,2,0,0,null,1,0,0,null,2,0,0,null,3,0,0,null,5,1,0,null,0,0,0,null,0,0,0,null,2,0,0,null,1,0,0,null,0,0,0,null,0,0,0,null,5,3,0,null,0,0,0,null,0,0,0,null,0,0,0,null,0,0,0,null,0,0,0,null,0,0,0,null,0,0,0,null,0,0,0,null,0,0,0,null,1,0,0,null,1,0,0,null,0,0,0,null,0,0,0]
[-13,null,7,2,0,null,0,0,0,null,0,0,0,null,1,0,0,null,4,1,0,null,0,0,0,null,0,0,0,null,1,0,0,null,1,0,0,null,2,0,0,null,0,0,0,null,3,1,0,null,0,0,0,null,0,0,0,null,1,0,0,null,2,0,0,null,1,0,0,null,1,0,0,null,2,0,0,null,1,0,0,null,0,0,0,null,0,0,0,null,0,0,0,null,4,0,0,null,3,0,0,null,0,0,0,null,0,0,0,null,8,5,0,null,0,0,0,null,2,0,0,null,3,0,0,null,0,0,0,null,0,0,0,null,3,1,0,null,1,0,0,null,1,0,0,null,0,0,0,null,2,0,0,null,1,0,0,null,4,1,0,null,0,0,0,null,3,0,0,null,1,0,0,null,4,0,0,null,1,0,0,null,4,1,0,null,3,2,0,null,5,1,0,null,0,0,0,null,0,0,0,null,3,0,0,null,2,0,0,null,1,0,0,null,1,0,0,null,8,4,0,null,0,0,0,null,0,0,0,null,0,0,0,null,0,0,0,null,0,0,0,null,0,0,0,null,2,0,0,null,0,0,0,null,2,0,0,null,5,0,0,null,1,0,0,null,0,0,0,null,0,0,0]
[-12,null,6,4,0,null,0,0,0,null,0,0,0,null,1,0,0,null,5,2,0,null,0,0,0,null,1,0,0,null,2,0,0,null,1,0,0,null,3,0,0,null,0,0,0,null,4,1,0,null,1,0,0,null,0,0,0,null,1,1,0,null,2,0,0,null,2,0,0,null,2,1,0,null,3,1,0,null,2,0,0,null,1,0,0,null,0,0,0,null,1,0,0,null,3,0,0,null,4,1,0,null,0,0,0,null,0,0,0,null,8,6,0,null,1,0,0,null,4,0,0,null,2,1,0,null,0,0,0,null,1,0,0,null,2,1,0,null,1,0,0,null,2,1,0,null,1,0,0,null,3,1,0,null,2,0,0,null,3,1,0,null,1,0,0,null,3,1,0,null,2,0,0,null,2,2,0,null,0,0,0,null,4,0,0,null,4,1,0,null,7,3,0,null,0,0,0,null,1,0,0,null,4,0,0,null,3,0,0,null,1,0,0,null,1,0,0,null,6,4,0,null,0,0,0,null,0,0,0,null,0,0,0,null,0,0,0,null,0,0,0,null,0,0,0,null,2,0,0,null,0,0,0,null,2,0,0,null,3,0,0,null,2,0,0,null,1,0,0,null,0,0,0]
[-11,null,8,2,0,null,0,0,0,null,0,0,0,null,1,0,0,null,6,4,0,null,0,0,0,null,1,0,0,null,2,1,0,null,3,1,0,null,2,1,0,null,0,0,0,null,3,1,0,null,0,0,0,null,2,0,0,null,2,1,0,null,3,0,0,null,2,0,0,null,3,1,0,null,3,0,0,null,2,0,0,null,1,0,0,null,1,0,0,null,2,0,0,null,4,1,0,null,4,1,0,null,1,0,0,null,0,0,0,null,8,6,1,null,1,0,0,null,2,1,0,null,4,1,0,null,0,0,0,null,1,0,0,null,3,1,0,null,2,1,0,null,3,1,0,null,1,0,0,null,3,1,0,null,3,0,0,null,5,2,0,null,1,0,0,null,2,2,0,null,3,0,0,null,5,2,0,null,2,0,0,null,4,1,0,null,6,2,0,null,7,3,0,null,0,0,0,null,1,0,0,null,4,1,0,null,3,0,0,null,2,0,0,null,3,0,0,null,7,4,1,null,0,0,0,null,0,0,0,null,1,0,0,null,0,0,0,null,0,0,0,null,0,0,0,null,3,0,0,null,0,0,0,null,3,1,0,null,4,1,0,null,2,0,0,null,0,0,0,null,1,0,0]
[-10,null,10,5,1,null,1,0,0,null,0,0,0,null,1,0,0,null,7,3,0,null,1,0,0,null,1,0,0,null,3,1,0,null,4,1,0,null,3,1,0,null,0,0,0,null,5,1,0,null,2,0,0,null,1,0,0,null,2,1,0,null,4,2,0,null,3,2,0,null,3,1,0,null,4,2,0,null,2,1,0,null,2,0,0,null,1,0,0,null,3,0,0,null,5,1,0,null,5,3,0,null,0,0,0,null,0,0,0,null,9,8,1,null,3,0,0,null,4,1,0,null,3,1,0,null,2,0,0,null,1,0,0,null,5,1,0,null,2,0,0,null,2,1,0,null,4,0,0,null,4,0,0,null,2,1,0,null,5,3,0,null,1,0,0,null,5,1,0,null,2,1,0,null,6,3,0,null,2,1,0,null,3,3,0,null,4,4,0,null,6,4,0,null,0,0,0,null,3,0,0,null,5,1,0,null,4,1,0,null,2,0,0,null,2,0,0,null,7,5,0,null,0,0,0,null,0,0,0,null,1,0,0,null,0,0,0,null,0,0,0,null,0,0,0,null,5,0,0,null,0,0,0,null,4,1,0,null,5,2,0,null,4,0,0,null,2,0,0,null,1,0,0]
[-9,null,11,6,1,null,1,0,0,null,0,0,0,null,3,1,0,null,6,3,1,null,1,0,0,null,1,0,0,null,5,1,0,null,4,3,1,null,4,1,0,null,1,0,0,null,5,2,1,null,2,0,0,null,1,0,0,null,5,1,1,null,4,1,0,null,3,1,0,null,4,2,1,null,5,3,0,null,3,1,0,null,2,1,0,null,1,0,0,null,3,0,0,null,6,2,0,null,7,2,0,null,1,0,0,null,0,0,0,null,7,7,2,null,5,1,0,null,6,2,0,null,4,2,0,null,2,0,0,null,3,1,0,null,5,3,0,null,3,1,0,null,4,2,0,null,4,1,0,null,5,2,0,null,4,1,0,null,7,3,0,null,1,1,0,null,5,4,0,null,3,1,0,null,5,3,0,null,2,1,0,null,5,3,0,null,7,3,0,null,8,6,0,null,0,0,0,null,3,0,0,null,4,2,0,null,6,3,0,null,1,0,0,null,4,1,0,null,9,7,1,null,2,0,0,null,0,0,0,null,2,0,0,null,0,0,0,null,0,0,0,null,0,0,0,null,5,1,0,null,0,0,0,null,5,1,1,null,5,4,0,null,4,1,0,null,2,0,0,null,3,0,0]
[-8,null,13,7,2,null,3,0,0,null,0,0,0,null,3,1,0,null,6,5,1,null,2,0,0,null,2,0,0,null,4,2,0,null,5,2,1,null,6,2,0,null,1,0,0,null,6,3,0,null,1,0,0,null,2,1,0,null,6,2,1,null,4,2,0,null,5,1,0,null,5,3,1,null,7,2,0,null,4,1,0,null,3,1,0,null,2,0,0,null,3,1,0,null,5,3,0,null,6,3,2,null,2,0,0,null,0,0,0,null,9,9,3,null,4,2,0,null,5,2,0,null,6,3,0,null,3,0,0,null,3,1,0,null,6,5,0,null,5,2,0,null,4,1,0,null,5,1,0,null,7,3,0,null,5,2,0,null,7,3,0,null,3,0,0,null,6,4,1,null,5,2,0,null,8,4,1,null,3,1,0,null,6,4,1,null,8,4,1,null,10,5,0,null,2,0,0,null,2,1,0,null,8,5,0,null,5,3,0,null,5,1,0,null,6,1,0,null,8,7,3,null,2,0,0,null,0,0,0,null,2,0,0,null,1,0,0,null,1,0,0,null,0,0,0,null,7,2,0,null,0,0,0,null,7,4,0,null,5,3,0,null,5,1,0,null,2,0,0,null,4,1,0]
[-7,null,10,7,4,null,4,1,0,null,0,0,0,null,4,2,0,null,9,5,1,null,2,1,0,null,3,2,0,null,6,3,0,null,7,6,2,null,6,2,0,null,2,0,0,null,8,3,1,null,3,1,0,null,2,0,0,null,8,4,2,null,5,3,0,null,4,1,0,null,6,3,0,null,6,4,0,null,5,2,0,null,4,2,0,null,2,0,0,null,5,1,0,null,7,6,1,null,9,6,1,null,3,0,0,null,1,0,0,null,10,8,3,null,6,4,1,null,7,2,0,null,5,3,0,null,3,1,0,null,3,2,0,null,7,3,1,null,5,1,0,null,7,3,0,null,4,2,0,null,8,3,1,null,5,4,0,null,9,5,1,null,4,2,0,null,9,5,1,null,5,3,0,null,8,5,2,null,4,3,1,null,7,4,1,null,8,4,1,null,12,6,0,null,2,0,0,null,4,2,0,null,9,5,0,null,8,4,1,null,5,2,0,null,8,2,0,null,9,8,3,null,3,0,0,null,1,0,0,null,3,0,0,null,1,0,0,null,1,0,0,null,2,0,0,null,9,2,0,null,1,0,0,null,8,5,2,null,9,5,2,null,6,3,0,null,6,1,0,null,4,2,0]
[-6,null,13,10,4,null,4,2,0,null,0,0,0,null,6,2,1,null,12,8,2,null,3,2,0,null,4,1,0,null,5,4,1,null,8,3,3,null,6,3,1,null,3,0,0,null,9,5,1,null,4,2,0,null,5,2,0,null,10,6,2,null,8,4,2,null,4,2,0,null,9,5,3,null,8,4,2,null,5,2,1,null,4,2,1,null,4,1,0,null,7,3,0,null,10,6,1,null,10,5,3,null,4,1,0,null,1,0,0,null,12,9,5,null,6,5,2,null,9,5,1,null,7,6,1,null,4,3,0,null,5,3,1,null,10,6,1,null,7,4,0,null,5,3,1,null,6,3,0,null,7,5,0,null,5,3,0,null,9,5,1,null,4,2,0,null,9,6,3,null,3,4,0,null,12,7,2,null,6,3,0,null,8,6,2,null,11,5,1,null,10,10,0,null,3,0,0,null,5,3,0,null,10,5,2,null,10,4,2,null,6,2,0,null,10,4,1,null,11,8,3,null,6,0,0,null,2,0,0,null,6,2,0,null,2,0,0,null,2,0,0,null,1,0,0,null,11,3,0,null,3,0,0,null,9,7,3,null,10,5,1,null,8,4,0,null,6,2,0,null,5,4,1]
[-5,null,13,13,6,null,8,5,1,null,1,0,0,null,7,4,1,null,14,8,3,null,4,3,1,null,4,1,0,null,9,4,2,null,11,6,4,null,10,4,1,null,6,0,0,null,11,6,2,null,4,2,0,null,4,2,0,null,10,9,4,null,9,3,2,null,9,3,2,null,11,6,4,null,9,5,1,null,10,3,0,null,6,3,0,null,5,3,0,null,9,5,1,null,11,5,3,null,12,6,3,null,9,3,0,null,3,0,0,null,13,14,4,null,9,5,4,null,10,5,2,null,10,5,2,null,4,4,0,null,6,4,1,null,8,6,2,null,10,5,2,null,7,6,2,null,9,5,0,null,11,6,2,null,7,5,2,null,13,5,1,null,6,4,1,null,13,7,2,null,7,4,1,null,12,7,4,null,6,4,2,null,9,5,3,null,11,6,3,null,11,13,0,null,6,0,0,null,5,4,1,null,11,6,1,null,12,8,3,null,9,4,0,null,13,5,1,null,12,10,5,null,12,1,0,null,3,0,0,null,9,1,0,null,3,0,0,null,4,0,0,null,2,0,0,null,13,7,2,null,3,0,0,null,10,7,4,null,11,6,3,null,12,6,1,null,9,3,0,null,7,4,2]
[-4,null,14,13,6,null,8,5,3,null,1,0,0,null,8,5,2,null,13,11,4,null,6,3,2,null,6,3,2,null,9,7,4,null,12,8,5,null,12,6,2,null,8,0,0,null,12,8,3,null,7,3,1,null,7,3,1,null,15,10,8,null,10,7,2,null,11,6,1,null,10,9,4,null,12,5,4,null,11,6,3,null,8,3,3,null,6,3,0,null,12,5,2,null,11,7,3,null,12,9,5,null,12,3,1,null,4,2,0,null,15,11,7,null,10,6,4,null,12,5,2,null,11,6,2,null,8,4,1,null,7,5,3,null,11,7,3,null,11,4,3,null,9,5,3,null,11,4,1,null,11,7,2,null,10,5,2,null,11,10,4,null,7,4,2,null,12,8,4,null,9,4,3,null,10,10,4,null,9,7,3,null,12,7,3,null,13,9,3,null,13,10,0,null,8,2,0,null,8,5,2,null,14,7,3,null,14,8,4,null,12,4,1,null,13,6,2,null,10,11,5,null,12,2,0,null,8,0,0,null,12,3,0,null,5,0,0,null,6,0,0,null,4,0,0,null,14,6,1,null,6,0,0,null,13,8,6,null,13,7,5,null,14,6,2,null,12,6,2,null,9,7,2]
[-3,null,15,13,9,null,11,7,4,null,4,0,0,null,13,6,3,null,14,9,5,null,7,5,2,null,9,4,1,null,13,5,4,null,14,11,5,null,13,7,3,null,8,2,0,null,12,7,4,null,12,4,2,null,9,5,2,null,15,13,9,null,14,6,4,null,11,5,3,null,13,9,7,null,12,8,4,null,13,5,2,null,12,6,3,null,10,4,3,null,17,7,3,null,12,9,4,null,13,12,7,null,13,7,3,null,7,2,0,null,13,10,10,null,12,6,5,null,14,6,2,null,14,8,4,null,10,5,3,null,10,4,3,null,15,8,5,null,13,6,2,null,13,6,4,null,11,7,2,null,14,10,3,null,11,7,2,null,12,11,3,null,9,8,4,null,16,11,6,null,9,6,2,null,15,13,5,null,9,5,5,null,14,11,5,null,14,12,3,null,13,11,0,null,13,2,0,null,10,5,2,null,14,9,4,null,14,10,3,null,13,7,2,null,15,9,3,null,14,12,8,null,16,3,0,null,10,0,0,null,16,4,0,null,8,0,0,null,9,1,0,null,7,1,0,null,16,10,2,null,11,1,0,null,16,11,6,null,12,11,4,null,13,8,3,null,13,6,4,null,11,4,6]
[-2,null,19,15,10,null,12,7,5,null,5,1,0,null,15,7,3,null,17,14,5,null,7,5,4,null,13,5,3,null,14,9,6,null,14,12,7,null,16,10,3,null,12,2,0,null,14,8,6,null,14,5,3,null,14,6,3,null,17,12,10,null,16,9,6,null,14,7,4,null,14,11,8,null,15,10,5,null,13,8,4,null,13,7,3,null,12,6,2,null,14,7,6,null,15,9,6,null,16,12,6,null,15,9,5,null,9,5,2,null,17,12,10,null,14,11,5,null,14,7,5,null,17,12,4,null,10,6,4,null,11,8,4,null,16,10,7,null,16,9,5,null,15,7,4,null,14,9,3,null,15,12,5,null,16,9,5,null,16,11,3,null,12,6,4,null,18,12,7,null,15,7,4,null,13,12,7,null,13,8,6,null,16,12,6,null,15,12,6,null,15,14,0,null,17,6,0,null,11,6,4,null,14,12,6,null,15,13,7,null,15,8,3,null,16,13,5,null,15,12,9,null,15,9,0,null,12,1,0,null,20,8,1,null,10,1,0,null,12,2,0,null,9,2,0,null,15,10,4,null,11,2,0,null,16,10,7,null,14,11,7,null,16,10,4,null,15,8,4,null,11,8,6]
[-1,null,20,15,11,null,15,8,5,null,11,2,0,null,17,9,4,null,19,13,8,null,11,7,4,null,14,7,2,null,19,9,7,null,14,11,9,null,16,9,7,null,12,3,0,null,14,11,3,null,16,7,3,null,16,8,4,null,18,16,11,null,20,11,7,null,19,10,4,null,16,12,9,null,17,12,7,null,17,11,7,null,13,9,5,null,12,7,5,null,15,10,5,null,15,13,9,null,16,13,9,null,15,8,7,null,12,7,3,null,16,11,13,null,12,11,8,null,13,10,4,null,19,14,7,null,15,8,4,null,15,8,6,null,18,13,7,null,19,10,4,null,15,11,5,null,16,10,4,null,15,12,10,null,17,12,6,null,15,12,7,null,15,9,6,null,22,13,9,null,16,9,5,null,15,12,9,null,15,9,6,null,15,13,8,null,16,11,7,null,17,14,0,null,18,8,2,null,15,9,5,null,15,13,7,null,19,14,9,null,18,9,6,null,17,15,6,null,18,13,10,null,18,12,1,null,14,2,0,null,22,12,2,null,11,2,0,null,17,3,0,null,12,2,1,null,18,15,4,null,16,3,0,null,16,15,10,null,16,14,8,null,17,13,8,null,17,9,7,null,13,9,5]
[0,null,21,14,13,null,18,12,7,null,16,5,1,null,19,12,5,null,20,15,10,null,11,8,6,null,17,7,5,null,20,12,7,null,18,14,9,null,16,12,8,null,14,6,0,null,16,14,7,null,13,8,5,null,15,9,5,null,21,19,14,null,21,14,7,null,20,11,7,null,19,15,11,null,20,13,6,null,20,11,6,null,17,11,6,null,19,9,6,null,19,15,7,null,19,15,9,null,19,13,9,null,19,11,5,null,15,8,5,null,19,12,13,null,16,12,9,null,18,13,7,null,20,17,8,null,16,10,7,null,15,11,6,null,21,15,7,null,18,14,5,null,19,11,7,null,19,14,6,null,16,15,7,null,21,14,8,null,16,12,7,null,19,10,7,null,20,15,9,null,18,13,6,null,21,13,12,null,17,11,7,null,20,15,12,null,15,15,9,null,18,13,0,null,20,10,2,null,11,10,6,null,18,16,8,null,18,15,10,null,17,12,6,null,19,18,8,null,21,12,13,null,18,15,1,null,13,3,0,null,22,14,3,null,14,2,0,null,12,5,0,null,14,3,0,null,21,15,8,null,17,7,0,null,19,16,12,null,19,13,10,null,18,14,7,null,17,13,5,null,17,12,7]
[1,null,18,14,12,null,18,13,8,null,19,8,2,null,16,16,6,null,15,16,13,null,13,10,7,null,15,11,6,null,19,16,9,null,14,13,8,null,16,15,8,null,12,9,1,null,16,12,6,null,14,12,6,null,16,11,8,null,17,16,14,null,21,14,10,null,19,14,7,null,20,13,12,null,18,14,10,null,19,14,9,null,18,12,7,null,16,11,6,null,17,14,8,null,22,16,10,null,17,15,12,null,18,17,7,null,16,11,7,null,18,13,14,null,16,12,9,null,16,13,5,null,19,14,12,null,19,15,6,null,18,12,7,null,18,16,12,null,16,16,6,null,15,14,8,null,18,14,8,null,14,15,11,null,20,16,10,null,14,14,9,null,16,15,8,null,17,16,10,null,20,15,8,null,16,14,11,null,18,15,8,null,18,15,12,null,13,12,8,null,18,15,0,null,16,16,5,null,18,13,8,null,21,14,9,null,14,14,11,null,17,16,6,null,19,13,10,null,17,13,12,null,14,17,3,null,15,7,0,null,17,17,5,null,15,6,0,null,15,9,1,null,15,6,1,null,15,17,8,null,21,12,2,null,17,15,11,null,19,16,11,null,19,17,10,null,17,14,7,null,16,12,8]
[2,null,15,15,13,null,15,14,9,null,18,13,3,null,13,16,10,null,17,14,12,null,16,12,8,null,17,12,6,null,16,13,9,null,14,10,12,null,16,15,8,null,12,9,2,null,15,14,7,null,14,12,8,null,14,13,7,null,17,16,16,null,18,13,10,null,19,13,13,null,18,15,12,null,19,17,9,null,17,14,11,null,18,11,9,null,16,14,7,null,15,16,9,null,21,13,11,null,16,14,11,null,15,14,8,null,18,13,8,null,16,15,14,null,18,15,9,null,15,13,10,null,17,15,13,null,17,15,9,null,12,13,10,null,17,15,11,null,11,15,10,null,16,14,9,null,13,15,9,null,12,15,11,null,13,17,10,null,13,14,11,null,16,18,9,null,16,15,13,null,16,13,10,null,16,15,11,null,16,15,10,null,15,16,12,null,14,13,12,null,17,14,0,null,17,18,7,null,14,13,9,null,18,14,11,null,15,14,10,null,19,13,7,null,14,16,16,null,17,16,15,null,13,12,4,null,15,9,1,null,16,20,6,null,15,8,1,null,14,10,2,null,16,8,2,null,15,14,10,null,15,13,2,null,16,16,13,null,17,14,11,null,14,15,10,null,14,13,8,null,16,13,8]
[3,null,15,15,11,null,14,17,11,null,17,15,6,null,12,13,8,null,13,14,10,null,16,13,9,null,16,14,8,null,15,13,11,null,16,12,12,null,12,16,8,null,15,12,2,null,16,13,10,null,17,13,8,null,17,14,8,null,18,16,15,null,16,15,12,null,18,16,9,null,17,15,11,null,18,13,12,null,18,16,9,null,15,16,9,null,15,13,8,null,18,15,11,null,15,15,13,null,19,14,10,null,15,16,11,null,18,15,9,null,17,15,11,null,14,11,12,null,14,13,9,null,14,14,13,null,14,16,11,null,15,13,8,null,15,14,12,null,12,13,12,null,15,14,9,null,13,16,10,null,10,10,13,null,15,15,12,null,12,12,11,null,16,14,12,null,13,15,11,null,15,15,9,null,18,15,10,null,14,13,11,null,12,13,14,null,15,13,12,null,16,14,0,null,17,14,9,null,15,12,9,null,18,14,12,null,17,13,10,null,19,15,10,null,14,15,14,null,13,11,12,null,14,16,7,null,14,11,2,null,13,18,7,null,17,10,2,null,15,13,2,null,14,10,2,null,15,17,11,null,15,15,3,null,19,16,14,null,15,14,12,null,18,13,12,null,17,16,10,null,16,14,11]
[4,null,16,17,12,null,17,13,13,null,16,16,7,null,11,11,10,null,12,13,16,null,15,13,10,null,18,13,9,null,16,15,11,null,16,15,9,null,12,13,9,null,15,15,4,null,18,15,9,null,17,13,8,null,18,15,11,null,16,15,12,null,16,16,12,null,14,16,10,null,17,14,14,null,15,12,13,null,18,13,13,null,17,15,11,null,18,14,9,null,13,13,13,null,19,16,12,null,16,14,10,null,16,16,14,null,14,17,10,null,16,14,11,null,14,14,12,null,14,10,11,null,14,13,14,null,16,14,12,null,14,12,10,null,14,14,13,null,13,11,11,null,14,12,11,null,15,12,11,null,14,10,11,null,14,11,14,null,14,10,12,null,16,13,13,null,14,14,12,null,14,14,10,null,13,15,12,null,15,13,12,null,14,12,13,null,12,11,12,null,18,14,0,null,15,16,10,null,11,14,10,null,14,14,13,null,19,14,14,null,18,15,11,null,15,12,13,null,18,10,13,null,16,14,8,null,10,17,1,null,17,15,10,null,14,15,2,null,13,15,5,null,14,12,3,null,12,13,13,null,13,16,6,null,15,15,14,null,16,14,14,null,16,13,11,null,18,15,11,null,16,12,11]
[5,null,18,16,13,null,17,12,12,null,17,17,11,null,14,15,10,null,12,11,11,null,13,12,11,null,16,15,11,null,13,13,13,null,15,14,10,null,16,12,12,null,15,16,6,null,15,14,11,null,18,16,12,null,18,15,12,null,20,15,13,null,17,12,11,null,20,14,13,null,17,15,12,null,14,13,11,null,13,15,12,null,19,14,12,null,17,15,13,null,19,12,11,null,16,15,13,null,16,13,13,null,16,12,12,null,16,14,15,null,18,14,11,null,13,14,9,null,15,13,11,null,13,11,12,null,14,14,13,null,15,13,10,null,16,12,12,null,15,13,9,null,14,12,12,null,13,12,10,null,13,9,12,null,15,13,13,null,12,12,12,null,11,13,13,null,13,15,11,null,15,14,12,null,19,14,10,null,14,12,13,null,13,10,11,null,14,11,10,null,17,14,0,null,15,13,12,null,20,13,11,null,16,13,13,null,17,13,13,null,16,14,12,null,16,14,12,null,17,13,9,null,16,12,12,null,16,14,3,null,18,14,12,null,15,17,4,null,16,14,4,null,17,16,4,null,16,11,12,null,15,17,5,null,22,14,13,null,14,13,10,null,17,13,13,null,20,12,13,null,16,14,12]
[6,null,18,15,14,null,16,14,10,null,16,13,11,null,16,12,13,null,13,13,11,null,14,14,11,null,21,14,10,null,17,14,12,null,18,16,9,null,16,11,11,null,15,16,10,null,20,15,12,null,18,14,11,null,20,15,13,null,19,16,14,null,17,17,12,null,15,15,12,null,17,12,10,null,15,15,10,null,17,14,14,null,16,13,13,null,18,13,11,null,15,13,11,null,17,15,14,null,16,14,11,null,16,12,11,null,18,15,11,null,15,11,13,null,19,13,11,null,16,9,10,null,11,15,10,null,17,12,12,null,13,13,9,null,13,14,9,null,15,14,11,null,16,14,11,null,16,10,12,null,13,11,9,null,15,11,12,null,13,11,11,null,17,13,11,null,13,15,11,null,17,14,14,null,16,16,11,null,17,14,11,null,15,12,10,null,13,13,11,null,16,16,0,null,16,16,11,null,15,11,10,null,15,13,13,null,18,14,12,null,15,14,11,null,13,15,15,null,19,13,10,null,11,14,13,null,16,14,6,null,16,14,17,null,15,17,6,null,17,13,7,null,18,14,8,null,16,11,13,null,14,16,10,null,19,17,16,null,17,16,15,null,16,14,13,null,15,11,13,null,17,16,11]
[7,null,16,14,13,null,17,15,13,null,14,17,14,null,15,11,11,null,15,13,10,null,14,12,11,null,17,14,14,null,14,14,10,null,17,14,11,null,15,13,12,null,18,17,10,null,16,14,14,null,19,13,13,null,20,14,13,null,20,16,14,null,13,13,9,null,18,13,14,null,16,13,13,null,16,15,12,null,18,13,11,null,17,17,14,null,17,14,11,null,16,15,12,null,17,15,11,null,20,15,12,null,14,15,13,null,17,14,15,null,10,14,11,null,18,15,11,null,17,10,10,null,16,12,11,null,16,14,10,null,14,14,13,null,14,11,10,null,16,10,10,null,15,11,10,null,16,12,11,null,16,11,8,null,14,11,10,null,14,12,11,null,15,13,12,null,14,14,11,null,12,12,10,null,15,16,16,null,15,12,9,null,16,11,9,null,11,9,10,null,18,16,0,null,19,13,13,null,12,12,10,null,17,14,14,null,17,16,10,null,17,17,13,null,15,14,11,null,16,11,10,null,14,13,15,null,15,15,9,null,17,14,12,null,16,17,10,null,16,14,10,null,19,17,9,null,16,13,14,null,14,13,14,null,18,17,14,null,16,16,11,null,18,12,12,null,16,17,12,null,17,14,12]
[8,null,16,15,12,null,18,14,12,null,15,15,13,null,15,12,11,null,15,13,9,null,14,12,12,null,18,14,11,null,15,11,9,null,19,16,15,null,17,11,12,null,15,16,11,null,17,15,14,null,17,17,15,null,20,14,12,null,19,18,14,null,16,12,11,null,17,14,12,null,19,15,10,null,14,13,10,null,16,15,10,null,17,14,11,null,16,13,12,null,17,14,11,null,22,15,17,null,16,15,13,null,16,13,9,null,15,16,15,null,10,17,12,null,16,14,13,null,14,13,10,null,14,13,7,null,16,14,12,null,15,13,8,null,14,12,10,null,11,10,11,null,16,11,9,null,16,11,12,null,12,10,9,null,14,12,10,null,15,9,8,null,14,13,9,null,17,14,12,null,15,13,11,null,15,16,12,null,14,13,10,null,13,13,7,null,16,12,10,null,18,15,0,null,16,14,13,null,15,13,11,null,17,15,9,null,17,17,12,null,15,15,13,null,19,12,12,null,15,15,11,null,14,11,13,null,16,15,10,null,15,12,14,null,13,16,12,null,17,16,13,null,16,17,9,null,18,14,13,null,14,14,14,null,18,18,13,null,14,13,16,null,14,14,13,null,18,15,11,null,18,15,12]
[9,null,15,17,13,null,16,15,11,null,16,12,14,null,14,10,10,null,17,14,10,null,13,13,10,null,15,15,11,null,15,12,11,null,15,15,13,null,14,13,12,null,15,15,14,null,17,15,15,null,18,13,12,null,20,18,15,null,20,18,15,null,17,14,12,null,15,15,10,null,18,14,13,null,16,15,12,null,15,12,13,null,18,13,11,null,16,16,11,null,15,13,12,null,18,19,12,null,18,18,13,null,16,14,10,null,17,15,12,null,6,16,11,null,16,15,14,null,15,13,9,null,16,11,10,null,17,14,10,null,15,12,11,null,15,12,13,null,13,12,12,null,16,13,10,null,15,13,9,null,16,11,9,null,15,13,7,null,14,11,9,null,15,11,11,null,18,12,11,null,16,12,10,null,19,14,15,null,14,11,9,null,14,13,9,null,14,15,9,null,17,17,0,null,15,16,15,null,16,12,11,null,18,15,12,null,18,17,12,null,16,13,13,null,18,12,10,null,14,15,10,null,16,14,12,null,14,13,13,null,18,16,14,null,14,14,15,null,16,16,14,null,16,16,14,null,16,13,11,null,15,13,14,null,18,18,14,null,15,15,11,null,20,15,9,null,16,15,13,null,18,14,14]
[10,null,11,17,15,null,16,13,13,null,15,15,13,null,13,11,11,null,15,11,10,null,17,13,10,null,17,14,12,null,15,15,11,null,19,17,14,null,18,12,10,null,17,12,13,null,19,15,13,null,17,17,12,null,18,13,12,null,15,17,13,null,15,13,10,null,18,12,13,null,17,17,11,null,18,17,13,null,18,15,11,null,16,14,12,null,17,15,12,null,16,13,13,null,15,16,11,null,18,16,12,null,14,14,12,null,18,14,14,null,2,19,13,null,20,15,14,null,19,11,9,null,17,15,9,null,14,13,14,null,15,10,11,null,16,13,10,null,16,11,9,null,16,12,9,null,13,12,10,null,13,12,10,null,15,13,10,null,14,11,7,null,14,11,11,null,18,14,13,null,13,12,9,null,19,16,13,null,14,13,12,null,17,15,9,null,16,14,9,null,16,16,0,null,18,14,13,null,20,12,10,null,17,18,12,null,19,16,13,null,15,15,14,null,17,13,12,null,9,16,10,null,19,14,15,null,14,14,17,null,19,14,17,null,16,15,14,null,17,14,15,null,14,15,16,null,17,13,12,null,17,11,15,null,19,18,15,null,18,17,12,null,19,15,12,null,16,13,11,null,17,15,12]
[11,null,6,15,16,null,19,13,12,null,12,14,14,null,16,14,10,null,15,13,10,null,15,11,11,null,14,15,11,null,17,14,13,null,18,18,12,null,17,18,10,null,17,15,16,null,17,15,14,null,18,11,12,null,21,17,11,null,14,18,15,null,18,16,14,null,18,14,9,null,19,14,11,null,17,14,12,null,18,13,12,null,19,13,12,null,16,14,11,null,19,15,13,null,13,18,12,null,17,17,13,null,18,13,14,null,17,13,13,null,2,15,11,null,16,18,13,null,18,13,9,null,17,12,9,null,17,15,13,null,14,11,11,null,15,14,10,null,17,16,9,null,13,13,11,null,15,13,8,null,15,13,8,null,15,15,10,null,16,12,11,null,15,12,11,null,19,14,11,null,15,13,10,null,14,16,14,null,17,12,10,null,19,12,10,null,16,13,10,null,12,18,0,null,22,14,13,null,15,14,12,null,16,16,11,null,20,17,13,null,19,15,11,null,18,14,11,null,5,18,12,null,17,14,12,null,12,14,14,null,16,17,13,null,15,14,16,null,17,12,15,null,18,15,15,null,20,16,10,null,14,13,11,null,14,17,17,null,18,16,12,null,16,19,11,null,18,13,13,null,16,15,14]
[12,null,3,15,16,null,15,17,12,null,15,13,13,null,15,13,10,null,16,13,11,null,14,12,12,null,18,13,11,null,16,15,12,null,17,16,15,null,20,13,9,null,15,15,15,null,18,16,11,null,17,16,11,null,19,18,11,null,12,15,15,null,15,17,12,null,16,16,13,null,14,16,12,null,16,16,12,null,15,16,11,null,18,15,12,null,18,13,14,null,19,16,12,null,12,17,15,null,14,18,12,null,16,13,12,null,15,14,11,null,0,15,15,null,19,17,11,null,20,14,10,null,18,12,10,null,16,14,11,null,17,14,11,null,19,12,9,null,17,13,9,null,15,14,10,null,19,17,9,null,14,13,9,null,18,13,9,null,18,15,9,null,16,13,9,null,15,15,13,null,17,15,12,null,13,17,14,null,15,13,10,null,18,14,10,null,17,11,10,null,6,16,0,null,17,15,12,null,17,14,11,null,16,15,10,null,16,17,15,null,16,16,13,null,20,15,12,null,2,14,10,null,20,15,12,null,16,13,13,null,17,15,13,null,16,12,14,null,18,15,14,null,17,15,17,null,16,17,10,null,15,14,15,null,13,16,16,null,16,16,14,null,19,16,12,null,18,15,13,null,19,18,12]
[13,null,0,14,15,null,19,17,11,null,17,14,13,null,17,16,11,null,11,15,13,null,15,13,9,null,17,15,14,null,16,16,10,null,16,16,17,null,18,13,12,null,19,13,13,null,12,15,13,null,20,16,14,null,17,17,12,null,9,16,17,null,15,16,10,null,14,16,11,null,13,15,11,null,14,15,12,null,14,15,10,null,17,15,12,null,19,15,11,null,15,16,9,null,10,17,16,null,10,16,13,null,18,16,13,null,21,16,13,null,0,17,14,null,18,17,14,null,18,15,8,null,19,15,11,null,17,17,11,null,14,15,11,null,13,13,9,null,14,14,10,null,18,13,9,null,19,15,9,null,18,13,10,null,18,15,10,null,15,14,11,null,18,14,10,null,12,17,12,null,19,15,12,null,13,17,19,null,17,14,10,null,16,16,10,null,15,13,10,null,4,15,0,null,19,13,11,null,11,16,8,null,12,17,13,null,10,15,14,null,16,16,13,null,16,17,9,null,0,16,14,null,20,16,12,null,18,12,15,null,19,17,12,null,15,14,14,null,16,14,15,null,18,14,15,null,15,14,10,null,18,14,13,null,8,18,18,null,14,16,17,null,16,15,14,null,17,17,9,null,21,16,15]
[14,null,0,11,12,null,18,16,12,null,20,14,11,null,17,13,11,null,7,17,11,null,16,12,11,null,17,17,11,null,15,16,11,null,11,16,13,null,18,15,13,null,18,13,15,null,9,18,13,null,14,15,12,null,16,16,14,null,5,13,13,null,12,15,12,null,11,16,10,null,10,16,13,null,11,18,11,null,13,16,12,null,15,16,11,null,17,19,13,null,13,16,12,null,6,17,16,null,7,19,16,null,18,18,10,null,17,14,13,null,0,12,12,null,13,15,15,null,11,17,9,null,13,16,12,null,18,15,12,null,18,12,10,null,12,15,10,null,18,13,10,null,14,13,9,null,17,14,12,null,17,13,8,null,17,14,10,null,17,14,9,null,17,15,8,null,8,16,14,null,16,15,11,null,6,16,13,null,19,14,9,null,16,16,9,null,15,16,11,null,2,13,0,null,19,17,14,null,20,18,10,null,7,16,14,null,8,17,16,null,15,15,13,null,12,17,13,null,0,13,13,null,17,14,13,null,19,13,12,null,14,16,13,null,14,15,15,null,18,17,12,null,18,16,14,null,10,16,11,null,16,14,14,null,8,14,16,null,10,19,15,null,11,16,13,null,14,16,11,null,15,17,12]
[15,null,0,12,15,null,15,16,12,null,18,11,14,null,16,14,8,null,2,15,11,null,17,14,10,null,16,15,11,null,13,14,10,null,8,17,17,null,11,17,11,null,19,13,15,null,5,16,12,null,15,17,11,null,14,17,13,null,6,11,13,null,8,17,11,null,9,15,12,null,6,16,15,null,8,16,14,null,11,15,10,null,14,18,11,null,16,18,13,null,13,16,12,null,4,15,16,null,3,13,16,null,15,15,10,null,19,16,10,null,0,9,16,null,13,17,18,null,10,16,11,null,10,16,8,null,17,16,12,null,16,14,9,null,9,16,11,null,17,12,8,null,14,11,12,null,15,15,10,null,19,14,10,null,14,14,10,null,11,16,11,null,17,12,10,null,4,15,15,null,16,14,10,null,6,12,15,null,18,13,9,null,11,16,11,null,9,14,11,null,1,13,0,null,14,18,12,null,22,15,14,null,4,15,12,null,4,17,17,null,12,18,13,null,7,17,13,null,0,15,13,null,19,16,13,null,17,16,14,null,8,16,12,null,18,14,14,null,23,16,14,null,16,17,13,null,4,17,10,null,19,16,12,null,5,13,15,null,5,14,15,null,5,18,13,null,11,16,12,null,14,18,12]
[16,null,0,6,13,null,11,16,12,null,20,13,12,null,17,14,11,null,0,14,15,null,18,15,9,null,15,15,11,null,8,16,12,null,6,12,15,null,8,17,12,null,20,14,12,null,3,16,13,null,12,15,11,null,9,20,12,null,3,9,16,null,4,16,12,null,7,15,10,null,5,15,14,null,4,14,16,null,7,16,11,null,10,15,10,null,14,16,12,null,8,16,12,null,0,12,16,null,1,12,16,null,14,17,13,null,17,17,11,null,0,5,16,null,9,17,15,null,5,19,11,null,5,14,13,null,13,15,15,null,19,13,10,null,4,15,13,null,13,14,11,null,12,13,7,null,13,15,12,null,13,12,8,null,11,19,11,null,8,14,9,null,16,15,11,null,1,15,16,null,12,16,11,null,3,11,15,null,14,15,11,null,4,16,11,null,4,16,11,null,0,9,0,null,12,17,14,null,16,19,15,null,1,15,13,null,1,12,15,null,7,15,12,null,3,16,15,null,0,12,13,null,12,15,12,null,20,15,13,null,6,15,11,null,17,17,12,null,17,18,12,null,17,13,13,null,2,17,13,null,17,15,12,null,3,11,15,null,3,13,14,null,3,18,14,null,11,16,12,null,10,15,16]
[17,null,0,5,15,null,10,17,14,null,17,18,10,null,13,14,11,null,0,13,12,null,16,12,11,null,9,18,11,null,5,16,15,null,4,11,14,null,2,14,12,null,17,17,12,null,1,16,15,null,9,18,11,null,5,16,11,null,1,8,14,null,2,13,16,null,4,16,12,null,1,13,13,null,1,15,16,null,5,17,14,null,8,14,13,null,10,16,10,null,5,15,15,null,0,11,15,null,0,14,14,null,9,15,14,null,13,18,16,null,0,1,14,null,6,14,16,null,2,16,11,null,2,16,12,null,14,15,15,null,15,13,12,null,3,14,14,null,10,17,10,null,8,14,10,null,8,18,12,null,8,16,11,null,8,15,13,null,3,14,9,null,14,16,10,null,1,14,13,null,8,16,11,null,2,11,12,null,10,17,11,null,2,14,15,null,2,15,13,null,0,6,0,null,6,18,13,null,9,16,14,null,0,13,16,null,1,12,13,null,4,17,13,null,1,17,14,null,0,9,12,null,5,18,11,null,17,14,11,null,3,16,14,null,18,15,11,null,16,15,10,null,17,15,13,null,0,14,13,null,18,13,11,null,2,8,13,null,1,12,17,null,1,13,14,null,5,16,13,null,7,17,16]
[18,null,0,3,11,null,6,16,16,null,18,16,13,null,8,17,13,null,0,12,12,null,15,16,11,null,7,17,10,null,3,14,15,null,3,10,15,null,1,15,13,null,12,16,12,null,0,14,15,null,6,16,13,null,3,17,15,null,2,4,11,null,0,14,15,null,2,15,15,null,1,10,14,null,0,10,13,null,2,14,16,null,3,16,13,null,8,17,14,null,2,15,13,null,0,10,14,null,0,9,16,null,5,17,15,null,11,15,12,null,0,0,13,null,4,12,14,null,1,16,13,null,1,12,14,null,8,16,15,null,10,19,11,null,1,13,15,null,3,15,13,null,4,16,11,null,3,14,12,null,3,14,12,null,3,14,14,null,1,15,13,null,10,17,14,null,0,10,14,null,6,15,14,null,0,8,14,null,8,14,12,null,1,14,14,null,0,16,14,null,0,5,0,null,3,17,13,null,8,17,12,null,0,12,16,null,0,9,14,null,1,15,16,null,0,13,13,null,0,5,14,null,3,14,11,null,16,14,13,null,0,15,14,null,16,13,12,null,11,13,12,null,13,14,13,null,0,13,13,null,12,16,12,null,1,6,14,null,0,11,14,null,0,14,15,null,1,16,14,null,5,12,15]
[19,null,0,2,13,null,3,10,14,null,12,18,13,null,5,15,12,null,0,9,12,null,13,16,13,null,4,16,12,null,0,12,13,null,2,9,16,null,0,16,14,null,7,18,10,null,0,9,14,null,4,16,15,null,2,14,16,null,0,5,9,null,0,11,13,null,0,14,15,null,0,9,12,null,0,11,14,null,1,13,13,null,3,16,16,null,4,16,16,null,0,14,15,null,0,6,13,null,0,5,13,null,2,13,15,null,7,17,14,null,0,0,12,null,2,10,15,null,0,15,18,null,0,13,13,null,5,13,14,null,8,14,13,null,0,10,12,null,2,16,12,null,2,14,14,null,2,13,15,null,1,15,14,null,1,12,13,null,0,15,14,null,6,14,12,null,0,6,14,null,2,13,14,null,0,6,16,null,4,14,12,null,0,12,13,null,0,13,13,null,0,2,0,null,0,18,12,null,6,15,15,null,0,8,15,null,0,7,15,null,1,13,13,null,0,11,15,null,0,3,13,null,1,17,15,null,12,12,11,null,0,15,17,null,14,15,11,null,6,16,11,null,8,15,13,null,0,10,15,null,9,16,10,null,0,5,12,null,0,8,13,null,0,10,14,null,1,12,15,null,2,12,15]
[20,null,0,0,8,null,0,12,13,null,8,16,12,null,2,15,14,null,0,4,13,null,13,15,12,null,1,14,15,null,0,11,14,null,0,6,13,null,0,12,14,null,3,13,13,null,0,9,16,null,1,14,14,null,0,10,13,null,0,4,9,null,0,10,12,null,0,11,13,null,0,8,13,null,0,8,13,null,0,11,14,null,0,12,14,null,2,12,17,null,0,11,14,null,0,5,14,null,0,4,11,null,0,13,14,null,4,15,16,null,0,0,11,null,2,9,15,null,0,14,14,null,0,10,13,null,2,13,15,null,4,14,14,null,0,11,14,null,1,14,13,null,1,14,11,null,1,14,15,null,0,16,12,null,0,13,14,null,0,13,15,null,2,13,14,null,0,4,14,null,1,13,15,null,0,4,14,null,1,12,13,null,0,8,13,null,0,10,15,null,0,1,0,null,0,16,14,null,4,13,16,null,0,5,14,null,0,5,11,null,0,9,14,null,0,10,16,null,0,0,12,null,0,16,14,null,7,16,9,null,0,10,11,null,9,16,11,null,2,16,13,null,6,13,14,null,0,10,14,null,3,13,15,null,0,4,10,null,0,4,12,null,0,9,14,null,0,13,13,null,3,11,14]
[21,null,0,0,9,null,0,10,14,null,5,15,13,null,1,13,14,null,0,3,12,null,6,13,14,null,1,12,15,null,0,9,13,null,1,6,11,null,0,12,15,null,1,15,15,null,0,5,13,null,1,12,15,null,0,8,16,null,0,2,7,null,0,9,15,null,0,8,13,null,0,4,10,null,0,7,12,null,0,8,13,null,0,8,13,null,0,11,13,null,0,9,15,null,0,3,10,null,0,3,13,null,0,11,13,null,4,11,14,null,0,0,12,null,0,6,11,null,0,13,14,null,0,8,12,null,0,11,13,null,2,13,13,null,0,8,12,null,0,14,16,null,1,14,13,null,0,12,15,null,0,11,14,null,0,9,13,null,0,10,15,null,1,12,15,null,0,3,12,null,0,9,11,null,0,2,13,null,1,14,13,null,0,6,12,null,0,7,13,null,0,0,0,null,0,11,15,null,1,12,13,null,0,4,13,null,0,4,12,null,0,8,14,null,0,4,13,null,0,0,12,null,0,14,13,null,3,15,11,null,0,6,15,null,5,15,13,null,1,12,14,null,3,13,14,null,0,6,15,null,3,15,14,null,0,2,9,null,0,3,13,null,0,5,13,null,0,8,14,null,0,7,15]
[22,null,0,0,10,null,0,7,12,null,2,16,14,null,0,12,14,null,0,1,13,null,4,12,13,null,0,9,14,null,0,8,16,null,0,4,10,null,0,8,14,null,1,14,14,null,0,2,13,null,0,8,14,null,0,6,14,null,0,1,8,null,0,4,14,null,0,7,11,null,0,4,11,null,0,5,16,null,0,7,13,null,0,8,12,null,0,9,15,null,0,6,13,null,0,2,11,null,0,1,11,null,0,7,14,null,1,11,14,null,0,0,8,null,0,4,12,null,0,9,14,null,0,4,14,null,1,9,13,null,1,13,14,null,0,5,13,null,0,10,15,null,0,12,11,null,0,9,12,null,0,10,13,null,0,8,14,null,0,6,12,null,0,10,12,null,0,1,11,null,0,10,14,null,0,1,10,null,0,11,11,null,0,4,14,null,0,4,13,null,0,0,0,null,0,7,17,null,1,9,15,null,0,3,11,null,0,2,9,null,0,4,13,null,0,3,13,null,0,0,12,null,0,7,15,null,0,16,15,null,0,5,14,null,2,14,13,null,0,16,13,null,3,14,13,null,0,5,13,null,0,15,14,null,0,1,7,null,0,3,10,null,0,3,12,null,0,7,13,null,0,6,12]
[23,null,0,0,5,null,0,5,14,null,0,14,15,null,0,7,15,null,0,0,11,null,2,13,13,null,0,8,13,null,0,5,12,null,0,2,11,null,0,4,13,null,0,13,15,null,0,1,13,null,0,7,13,null,0,5,14,null,0,1,4,null,0,4,13,null,0,5,13,null,0,2,10,null,0,2,10,null,0,5,12,null,0,5,13,null,0,6,12,null,0,5,13,null,0,0,10,null,0,0,9,null,0,5,13,null,0,8,15,null,0,0,8,null,0,5,10,null,0,6,15,null,0,3,13,null,0,6,14,null,0,11,13,null,0,4,12,null,0,7,16,null,0,8,14,null,0,6,12,null,0,6,13,null,0,5,15,null,0,5,14,null,0,10,13,null,0,1,11,null,0,6,15,null,0,0,8,null,0,8,14,null,0,1,13,null,0,2,15,null,0,0,0,null,0,5,13,null,0,5,13,null,0,0,11,null,0,0,10,null,0,5,14,null,0,1,11,null,0,0,10,null,0,5,12,null,0,16,11,null,0,3,14,null,1,15,14,null,0,14,14,null,1,13,12,null,0,2,13,null,0,13,12,null,0,0,5,null,0,0,9,null,0,2,12,null,0,5,13,null,0,5,11]
[24,null,0,0,5,null,0,3,10,null,0,12,16,null,0,6,16,null,0,0,11,null,1,12,10,null,0,6,15,null,0,3,11,null,0,1,6,null,0,2,13,null,0,12,16,null,0,0,12,null,0,5,14,null,0,3,13,null,0,0,4,null,0,2,9,null,0,4,13,null,0,1,9,null,0,1,12,null,0,4,12,null,0,6,11,null,0,6,14,null,0,2,10,null,0,0,7,null,0,0,10,null,0,4,11,null,0,4,12,null,0,0,6,null,0,2,10,null,0,3,12,null,0,1,11,null,0,5,12,null,0,8,14,null,0,2,13,null,0,4,13,null,0,5,14,null,0,3,14,null,0,4,13,null,0,2,15,null,0,2,13,null,0,5,13,null,0,0,9,null,0,4,14,null,0,0,8,null,0,4,14,null,0,1,11,null,0,1,11,null,0,0,0,null,0,1,12,null,0,5,14,null,0,0,9,null,0,0,8,null,0,2,12,null,0,0,10,null,0,0,8,null,0,4,12,null,0,16,13,null,0,1,14,null,0,13,15,null,0,11,14,null,0,13,14,null,0,1,11,null,0,10,15,null,0,0,5,null,0,0,7,null,0,0,12,null,0,5,12,null,0,2,10]
[25,null,0,0,4,null,0,2,11,null,0,6,13,null,0,3,13,null,0,0,9,null,0,9,15,null,0,5,13,null,0,2,11,null,0,1,7,null,0,0,10,null,0,9,13,null,0,0,10,null,0,4,14,null,0,2,10,null,0,0,2,null,0,0,9,null,0,1,12,null,0,1,8,null,0,0,8,null,0,2,13,null,0,2,15,null,0,3,13,null,0,1,11,null,0,0,6,null,0,0,6,null,0,3,12,null,0,5,11,null,0,0,3,null,0,1,6,null,0,2,13,null,0,1,11,null,0,2,10,null,0,4,12,null,0,0,10,null,0,3,14,null,0,3,13,null,0,3,13,null,0,4,12,null,0,2,10,null,0,0,12,null,0,4,14,null,0,0,9,null,0,2,12,null,0,0,6,null,0,3,12,null,0,0,10,null,0,0,10,null,0,0,0,null,0,0,14,null,0,4,15,null,0,0,9,null,0,0,9,null,0,1,12,null,0,0,11,null,0,0,9,null,0,1,14,null,0,12,14,null,0,0,14,null,0,11,12,null,0,7,11,null,0,10,12,null,0,0,11,null,0,6,11,null,0,0,2,null,0,0,7,null,0,0,10,null,0,1,10,null,0,3,8]
[26,null,0,0,2,null,0,1,9,null,0,5,14,null,0,3,12,null,0,0,9,null,0,4,11,null,0,2,11,null,0,0,8,null,0,0,5,null,0,0,12,null,0,4,13,null,0,0,9,null,0,2,11,null,0,1,9,null,0,0,3,null,0,0,9,null,0,1,10,null,0,0,6,null,0,0,8,null,0,1,7,null,0,1,9,null,0,2,10,null,0,0,9,null,0,0,6,null,0,0,5,null,0,0,10,null,0,3,11,null,0,0,1,null,0,0,6,null,0,0,12,null,0,0,10,null,0,1,11,null,0,2,10,null,0,0,10,null,0,1,12,null,0,2,13,null,0,1,12,null,0,0,12,null,0,0,10,null,0,0,11,null,0,2,12,null,0,0,7,null,0,1,10,null,0,0,4,null,0,2,10,null,0,0,8,null,0,0,9,null,0,0,0,null,0,0,12,null,0,2,12,null,0,0,10,null,0,0,6,null,0,0,10,null,0,0,9,null,0,0,8,null,0,0,12,null,0,9,13,null,0,0,13,null,0,6,12,null,0,6,11,null,0,7,12,null,0,0,12,null,0,5,12,null,0,0,2,null,0,0,4,null,0,0,8,null,0,0,10,null,0,1,8]
[27,null,0,0,1,null,0,0,8,null,0,1,14,null,0,0,11,null,0,0,9,null,0,4,11,null,0,1,13,null,0,0,9,null,0,0,4,null,0,0,12,null,0,1,15,null,0,0,7,null,0,1,10,null,0,0,9,null,0,0,2,null,0,0,8,null,0,0,9,null,0,0,6,null,0,0,7,null,0,0,9,null,0,1,9,null,0,1,10,null,0,0,9,null,0,0,3,null,0,0,4,null,0,0,8,null,0,0,8,null,0,0,0,null,0,0,5,null,0,0,12,null,0,0,7,null,0,0,9,null,0,3,13,null,0,0,9,null,0,0,11,null,0,1,11,null,0,0,12,null,0,0,13,null,0,0,9,null,0,0,11,null,0,1,10,null,0,0,4,null,0,0,9,null,0,0,2,null,0,1,10,null,0,0,7,null,0,0,10,null,0,0,0,null,0,0,13,null,0,1,10,null,0,0,6,null,0,0,5,null,0,0,9,null,0,0,7,null,0,0,4,null,0,0,14,null,0,4,11,null,0,0,11,null,0,4,15,null,0,2,14,null,0,5,11,null,0,0,8,null,0,3,13,null,0,0,1,null,0,0,5,null,0,0,7,null,0,0,9,null,0,0,6]
[28,null,0,0,0,null,0,0,6,null,0,0,14,null,0,0,12,null,0,0,7,null,0,3,10,null,0,1,10,null,0,0,7,null,0,0,3,null,0,0,9,null,0,0,10,null,0,0,6,null,0,0,8,null,0,0,6,null,0,0,1,null,0,0,7,null,0,0,7,null,0,0,4,null,0,0,6,null,0,0,7,null,0,0,7,null,0,0,8,null,0,0,8,null,0,0,3,null,0,0,3,null,0,0,8,null,0,0,9,null,0,0,0,null,0,0,4,null,0,0,10,null,0,0,8,null,0,0,7,null,0,0,11,null,0,0,6,null,0,0,12,null,0,0,12,null,0,0,7,null,0,0,10,null,0,0,8,null,0,0,10,null,0,0,9,null,0,0,4,null,0,0,8,null,0,0,1,null,0,0,11,null,0,0,9,null,0,0,9,null,0,0,0,null,0,0,11,null,0,0,8,null,0,0,5,null,0,0,4,null,0,0,6,null,0,0,4,null,0,0,2,null,0,0,12,null,0,3,13,null,0,0,7,null,0,2,15,null,0,0,12,null,0,3,12,null,0,0,8,null,0,1,13,null,0,0,0,null,0,0,2,null,0,0,5,null,0,0,7,null,0,0,5]
[29,null,0,0,0,null,0,0,6,null,0,0,13,null,0,0,10,null,0,0,5,null,0,1,11,null,0,0,8,null,0,0,6,null,0,0,1,null,0,0,8,null,0,0,11,null,0,0,3,null,0,0,6,null,0,0,6,null,0,0,0,null,0,0,5,null,0,0,6,null,0,0,3,null,0,0,5,null,0,0,5,null,0,0,5,null,0,0,5,null,0,0,5,null,0,0,1,null,0,0,2,null,0,0,6,null,0,0,5,null,0,0,0,null,0,0,2,null,0,0,9,null,0,0,8,null,0,0,6,null,0,0,10,null,0,0,6,null,0,0,8,null,0,0,10,null,0,0,9,null,0,0,10,null,0,0,7,null,0,0,10,null,0,0,8,null,0,0,2,null,0,0,9,null,0,0,0,null,0,0,9,null,0,0,7,null,0,0,7,null,0,0,0,null,0,0,6,null,0,0,5,null,0,0,4,null,0,0,2,null,0,0,5,null,0,0,3,null,0,0,1,null,0,0,12,null,0,0,14,null,0,0,5,null,0,0,14,null,0,0,12,null,0,1,12,null,0,0,7,null,0,0,12,null,0,0,0,null,0,0,2,null,0,0,6,null,0,0,7,null,0,0,4]
[30,null,0,0,0,null,0,0,10,null,0,0,19,null,0,0,18,null,0,0,7,null,0,0,30,null,0,0,25,null,0,0,10,null,0,0,1,null,0,0,12,null,0,0,37,null,0,0,4,null,0,0,17,null,0,0,14,null,0,0,0,null,0,0,10,null,0,0,17,null,0,0,4,null,0,0,7,null,0,0,15,null,0,0,17,null,0,0,18,null,0,0,10,null,0,0,1,null,0,0,0,null,0,0,12,null,0,0,11,null,0,0,0,null,0,0,1,null,0,0,23,null,0,0,17,null,0,0,9,null,0,0,22,null,0,0,12,null,0,0,21,null,0,0,26,null,0,0,27,null,0,0,20,null,0,0,17,null,0,0,18,null,0,0,17,null,0,0,3,null,0,0,19,null,0,0,0,null,0,0,19,null,0,0,11,null,0,0,13,null,0,0,0,null,0,0,12,null,0,0,14,null,0,0,4,null,0,0,1,null,0,0,11,null,0,0,2,null,0,0,0,null,0,0,20,null,0,0,63,null,0,0,8,null,0,0,46,null,0,0,49,null,0,0,44,null,0,0,10,null,0,0,39,null,0,0,0,null,0,0,0,null,0,0,6,null,0,0,14,null,0,0,5]

{"sheet":"AT-Vergleichsdaten","index":11,"n_rows":60,"n_cols":273,"rows_kept":60,"cut":false,"hidden":true,"merged":[]}
[null,null,"Davos (CH)",null,null,null,"Zürich/Fluntern (CH)",null,null,null,"Locarno/Monti (CH)",null,null,null,"Graz Universität (AT)",null,null,null,"Tamsweg (AT)",null,null,null,"Wien innere Stadt (AT)",null,null,null,"Karlsruhe/Rheinstetten (DE)",null,null,null,"München Flughafen (DE)",null,null,null,"Hohenpeißenberg (DE)",null,null,null,"BRNIK LETALIŠČE (SI)",null,null,null,"BILJE (SI)",null,null,null,"NOVA VAS, BLOKE (SI)",null,null,null,"Frankfurt/Main Flughafen (DE)",null,null,null,"Trier-Petrisberg (DE)",null,null,null,"Kahler Asten (DE)",null,null,null,"Augsburg (DE)",null,null,null,"Bamberg (DE)",null,null,null,"Hof (DE)",null,null,null,"Kempten (DE)",null,null,null,"Nürnberg (DE)",null,null,null,"Würzburg (DE)",null,null,null,"Basel-Binningen (CH)",null,null,null,"Bern/Zollikofen (CH)",null,null,null,"La Chaux-de-Fonds (CH)",null,null,null,"Engelberg (CH)",null,null,null,"Luzern (CH)",null,null,null,"Pully (CH)",null,null,null,"Samedan (CH)",null,null,null,"St. Gallen (CH)",null,null,null,"Visp (CH)",null,null,null,"Bad Aussee (AT)",null,null,null,"Bregenz (AT)",null,null,null,"Eisenstadt (AT)",null,null,null,"Freistadt (AT)",null,null,null,"Fürstenfeld (AT)",null,null,null,"Hohenau/March (AT)",null,null,null,"Innsbruck Universität (AT)",null,null,null,"Klagenfurt Flughafen (AT)",null,null,null,"Kufstein (AT)",null,null,null,"Lienz (AT)",null,null,null,"Linz Stadt (AT)",null,null,null,"Mariazell (AT)",null,null,null,"Salzburg-Freisaal (AT)",null,null,null,"Schröcken (AT)",null,null,null,"St. Pölten (AT)",null,null,null,"Zell am See (AT)",null,null,null,"Zeltweg (AT)",null,null,null,"Andermatt (CH)",null,null,null,"Acquarossa/Comprovasco (CH)",null,null,null,"Bad Ragaz (CH)",null,null,null,"Château-d'Oex (CH)",null,null,null,"Disentis/Sedrun (CH)",null,null,null,"Fribourg/Posieux (CH)",null,null,null,"Piotta (CH)",null,null,null,"Ulrichen (CH)",null,null,null,"Barcis (IT)",null,null,null,"Codroipo (IT)",null,null,null,"Forni di Sopra (IT)",null,null,null,"Gemona (IT)",null,null,null,"San Pietro al Nasitone (IT)",null,null,null,"Sgonico (IT)",null,null,null,"Tarvisio (IT)",null,null,null,"Tolmezzo (IT)",null,null,null,"Bullet / La Fretaz (CH)",null,null,null,"Einsiedeln (CH)",null,null,null,"Langnau i.E. (CH)",null,null,null,"Payerne (CH)",null,null,null,"Rünenberg (CH)"]
[null,null,null,1,null,null,null,0,null,null,null,0,null,null,null,1,null,null,null,0,null,null,null,0,null,null,null,0,null,null,null,0,null,null,null,0,null,null,null,0,null,null,null,0,null,null,null,0,null,null,null,0,null,null,null,0,null,null,null,0,null,null,null,0,null,null,null,0,null,null,null,1,null,null,null,0,null,null,null,0,null,null,null,0,null,null,null,0,null,null,null,0,null,null,null,0,null,null,null,0,null,null,null,0,null,null,null,0,null,null,null,0,null,null,null,0,null,null,null,0,null,null,null,0,null,null,null,0,null,null,null,0,null,null,null,0,null,null,null,0,null,null,null,0,null,null,null,0,null,null,null,0,null,null,null,0,null,null,null,0,null,null,null,0,null,null,null,0,null,null,null,0,null,null,null,0,null,null,null,0,null,null,null,0,null,null,null,0,null,null,null,0,null,null,null,0,null,null,null,0,null,null,null,0,null,null,null,0,null,null,null,0,null,null,null,0,null,null,null,0,null,null,null,0,null,null,null,0,null,null,null,0,null,null,null,1,null,null,null,0,null,null,null,0,null,null,null,0,null,null,null,0,null,null,null,0,null,null,null,0,null,null,null,0,null,null,null,0,null,null,null,0]
[null,null,{"$f":"IF(D2=1,Klimadaten!C3,\"\")","v":"Davos (CH)"},null,null,null,{"$f":"IF(H2=1,Klimadaten!G3,\"\")","v":""},null,null,null,{"$f":"IF(L2=1,Klimadaten!K3,\"\")","v":""},null,null,null,{"$f":"IF(P2=1,Klimadaten!O3,\"\")","v":"Graz Universität (AT)"},null,null,null,{"$f":"IF(T2=1,Klimadaten!S3,\"\")","v":""},null,null,null,{"$f":"IF(X2=1,Klimadaten!W3,\"\")","v":""},null,null,null,{"$f":"IF(AB2=1,Klimadaten!AA3,\"\")","v":""},null,null,null,{"$f":"IF(AF2=1,Klimadaten!AE3,\"\")","v":""},null,null,null,{"$f":"IF(AJ2=1,Klimadaten!AI3,\"\")","v":""},null,null,null,{"$f":"IF(AN2=1,Klimadaten!AM3,\"\")","v":""},null,null,null,{"$f":"IF(AR2=1,Klimadaten!AQ3,\"\")","v":""},null,null,null,{"$f":"IF(AV2=1,Klimadaten!AU3,\"\")","v":""},null,null,null,{"$f":"IF(AZ2=1,Klimadaten!AY3,\"\")","v":""},null,null,null,{"$f":"IF(BD2=1,Klimadaten!BC3,\"\")","v":""},null,null,null,{"$f":"IF(BH2=1,Klimadaten!BG3,\"\")","v":""},null,null,null,{"$f":"IF(BL2=1,Klimadaten!BK3,\"\")","v":""},null,null,null,{"$f":"IF(BP2=1,Klimadaten!BO3,\"\")","v":""},null,null,null,{"$f":"IF(BT2=1,Klimadaten!BS3,\"\")","v":"Hof (DE)"},null,null,null,{"$f":"IF(BX2=1,Klimadaten!BW3,\"\")","v":""},null,null,null,{"$f":"IF(CB2=1,Klimadaten!CA3,\"\")","v":""},null,null,null,{"$f":"IF(CF2=1,Klimadaten!CE3,\"\")","v":""},null,null,null,{"$f":"IF(CJ2=1,Klimadaten!CI3,\"\")","v":""},null,null,null,{"$f":"IF(CN2=1,Klimadaten!CM3,\"\")","v":""},null,null,null,{"$f":"IF(CR2=1,Klimadaten!CQ3,\"\")","v":""},null,null,null,{"$f":"IF(CV2=1,Klimadaten!CU3,\"\")","v":""},null,null,null,{"$f":"IF(CZ2=1,Klimadaten!CY3,\"\")","v":""},null,null,null,{"$f":"IF(DD2=1,Klimadaten!DC3,\"\")","v":""},null,null,null,{"$f":"IF(DH2=1,Klimadaten!DG3,\"\")","v":""},null,null,null,{"$f":"IF(DL2=1,Klimadaten!DK3,\"\")","v":""},null,null,null,{"$f":"IF(DP2=1,Klimadaten!DO3,\"\")","v":""},null,null,null,{"$f":"IF(DT2=1,Klimadaten!DS3,\"\")","v":""},null,null,null,{"$f":"IF(DX2=1,Klimadaten!DW3,\"\")","v":""},null,null,null,{"$f":"IF(EB2=1,Klimadaten!EA3,\"\")","v":""},null,null,null,{"$f":"IF(EF2=1,Klimadaten!EE3,\"\")","v":""},null,null,null,{"$f":"IF(EJ2=1,Klimadaten!EI3,\"\")","v":""},null,null,null,{"$f":"IF(EN2=1,Klimadaten!EM3,\"\")","v":""},null,null,null,{"$f":"IF(ER2=1,Klimadaten!EQ3,\"\")","v":""},null,null,null,{"$f":"IF(EV2=1,Klimadaten!EU3,\"\")","v":""},null,null,null,{"$f":"IF(EZ2=1,Klimadaten!EY3,\"\")","v":""},null,null,null,{"$f":"IF(FD2=1,Klimadaten!FC3,\"\")","v":""},null,null,null,{"$f":"IF(FH2=1,Klimadaten!FG3,\"\")","v":""},null,null,null,{"$f":"IF(FL2=1,Klimadaten!FK3,\"\")","v":""},null,null,null,{"$f":"IF(FP2=1,Klimadaten!FO3,\"\")","v":""},null,null,null,{"$f":"IF(FT2=1,Klimadaten!FS3,\"\")","v":""},null,null,null,{"$f":"IF(FX2=1,Klimadaten!FW3,\"\")","v":""},null,null,null,{"$f":"IF(GB2=1,Klimadaten!GA3,\"\")","v":""},null,null,null,{"$f":"IF(GF2=1,Klimadaten!GE3,\"\")","v":""},null,null,null,{"$f":"IF(GJ2=1,Klimadaten!GI3,\"\")","v":""},null,null,null,{"$f":"IF(GN2=1,Klimadaten!GM3,\"\")","v":""},null,null,null,{"$f":"IF(GR2=1,Klimadaten!GQ3,\"\")","v":""},null,null,null,{"$f":"IF(GV2=1,Klimadaten!GU3,\"\")","v":""},null,null,null,{"$f":"IF(GZ2=1,Klimadaten!GY3,\"\")","v":""},null,null,null,{"$f":"IF(HD2=1,Klimadaten!HC3,\"\")","v":""},null,null,null,{"$f":"IF(HH2=1,Klimadaten!HG3,\"\")","v":""},null,null,null,{"$f":"IF(HL2=1,Klimadaten!HK3,\"\")","v":""},null,null,null,{"$f":"IF(HP2=1,Klimadaten!HO3,\"\")","v":""},null,null,null,{"$f":"IF(HT2=1,Klimadaten!HS3,\"\")","v":""},null,null,null,{"$f":"IF(HX2=1,Klimadaten!HW3,\"\")","v":""},null,null,null,{"$f":"IF(IB2=1,Klimadaten!IA3,\"\")","v":"Gemona (IT)"},null,null,null,{"$f":"IF(IF2=1,Klimadaten!IE3,\"\")","v":""},null,null,null,{"$f":"IF(IJ2=1,Klimadaten!II3,\"\")","v":""},null,null,null,{"$f":"IF(IN2=1,Klimadaten!IM3,\"\")","v":""},null,null,null,{"$f":"IF(IR2=1,Klimadaten!IQ3,\"\")","v":""},null,null,null,{"$f":"IF(IV2=1,Klimadaten!IU3,\"\")","v":""},null,null,null,{"$f":"IF(IZ2=1,Klimadaten!IY3,\"\")","v":""},null,null,null,{"$f":"IF(JD2=1,Klimadaten!JC3,\"\")","v":""},null,null,null,{"$f":"IF(JH2=1,Klimadaten!JG3,\"\")","v":""},null,null,null,{"$f":"IF(JL2=1,Klimadaten!JK3,\"\")","v":""}]
[]
[]
[null,null,"Häufigkeit",null,null,null,"Häufigkeit",null,null,null,"Häufigkeit",null,null,null,"Häufigkeit",null,null,null,"Häufigkeit",null,null,null,"Häufigkeit",null,null,null,"Häufigkeit",null,null,null,"Häufigkeit",null,null,null,"Häufigkeit",null,null,null,"Häufigkeit",null,null,null,"Häufigkeit",null,null,null,"Häufigkeit",null,null,null,"Häufigkeit",null,null,null,"Häufigkeit",null,null,null,"Häufigkeit",null,null,null,"Häufigkeit",null,null,null,"Häufigkeit",null,null,null,"Häufigkeit",null,null,null,"Häufigkeit",null,null,null,"Häufigkeit",null,null,null,"Häufigkeit",null,null,null,"Häufigkeit",null,null,null,"Häufigkeit",null,null,null,"Häufigkeit",null,null,null,"Häufigkeit",null,null,null,"Häufigkeit",null,null,null,"Häufigkeit",null,null,null,"Häufigkeit",null,null,null,"Häufigkeit",null,null,null,"Häufigkeit",null,null,null,"Häufigkeit",null,null,null,"Häufigkeit",null,null,null,"Häufigkeit",null,null,null,"Häufigkeit",null,null,null,"Häufigkeit",null,null,null,"Häufigkeit",null,null,null,"Häufigkeit",null,null,null,"Häufigkeit",null,null,null,"Häufigkeit",null,null,null,"Häufigkeit",null,null,null,"Häufigkeit",null,null,null,"Häufigkeit",null,null,null,"Häufigkeit",null,null,null,"Häufigkeit",null,null,null,"Häufigkeit",null,null,null,"Häufigkeit",null,null,null,"Häufigkeit",null,null,null,"Häufigkeit",null,null,null,"Häufigkeit",null,null,null,"Häufigkeit",null,null,null,"Häufigkeit",null,null,null,"Häufigkeit",null,null,null,"Häufigkeit",null,null,null,"Häufigkeit",null,null,null,"Häufigkeit",null,null,null,"Häufigkeit",null,null,null,"Häufigkeit",null,null,null,"Häufigkeit",null,null,null,"Häufigkeit",null,null,null,"Häufigkeit",null,null,null,"Häufigkeit",null,null,null,"Häufigkeit",null,null,null,"Häufigkeit",null,null,null,"Häufigkeit",null,null,null,"Häufigkeit",null,null,null,"Häufigkeit",null,null,null,"Häufigkeit",null,null,null,"Häufigkeit"]
[null,null,"Min.","Mittel","Max.",null,"Min.","Mittel","Max.",null,"Min.","Mittel","Max.",null,"Min.","Mittel","Max.",null,"Min.","Mittel","Max.",null,"Min.","Mittel","Max.",null,"Min.","Mittel","Max.",null,"Min.","Mittel","Max.",null,"Min.","Mittel","Max.",null,"Min.","Mittel","Max.",null,"Min.","Mittel","Max.",null,"Min.","Mittel","Max.",null,"Min.","Mittel","Max.",null,"Min.","Mittel","Max.",null,"Min.","Mittel","Max.",null,"Min.","Mittel","Max.",null,"Min.","Mittel","Max.",null,"Min.","Mittel","Max.",null,"Min.","Mittel","Max.",null,"Min.","Mittel","Max.",null,"Min.","Mittel","Max.",null,"Min.","Mittel","Max.",null,"Min.","Mittel","Max.",null,"Min.","Mittel","Max.",null,"Min.","Mittel","Max.",null,"Min.","Mittel","Max.",null,"Min.","Mittel","Max.",null,"Min.","Mittel","Max.",null,"Min.","Mittel","Max.",null,"Min.","Mittel","Max.",null,"Min.","Mittel","Max.",null,"Min.","Mittel","Max.",null,"Min.","Mittel","Max.",null,"Min.","Mittel","Max.",null,"Min.","Mittel","Max.",null,"Min.","Mittel","Max.",null,"Min.","Mittel","Max.",null,"Min.","Mittel",null,null,"Min.","Mittel","Max.",null,"Min.","Mittel","Max.",null,"Min.","Mittel","Max.",null,"Min.","Mittel","Max.",null,"Min.","Mittel","Max.",null,"Min.","Mittel","Max.",null,"Min.","Mittel","Max.",null,"Min.","Mittel","Max.",null,"Min.","Mittel","Max.",null,"Min.","Mittel","Max.",null,"Min.","Mittel","Max.",null,"Min.","Mittel","Max.",null,"Min.","Mittel","Max.",null,"Min.","Mittel","Max.",null,"Min.","Mittel","Max.",null,"Min.","Mittel","Max.",null,"Min.","Mittel","Max.",null,"Min.","Mittel","Max.",null,"Min.","Mittel","Max.",null,"Min.","Mittel","Max.",null,"Min.","Mittel","Max.",null,"Min.","Mittel","Max.",null,"Min.","Mittel","Max.",null,"Min.","Mittel","Max.",null,"Min.","Mittel","Max.",null,"Min.","Mittel","Max.",null,"Min.","Mittel","Max.",null,"Min.","Mittel","Max.",null,"Min.","Mittel","Max.",null,"Min.","Mittel","Max."]
[]
[]
[-20,null,null,{"$f":"IF(D$2=1,Klimadaten!D10,\"\")","v":0},null,null,null,{"$f":"IF(H$2=1,Klimadaten!H10,\"\")","v":""},null,null,null,{"$f":"IF(L$2=1,Klimadaten!L10,\"\")","v":""},null,null,null,{"$f":"IF(P$2=1,Klimadaten!P10,\"\")","v":0},null,null,null,{"$f":"IF(T$2=1,Klimadaten!T10,\"\")","v":""},null,null,null,{"$f":"IF(X$2=1,Klimadaten!X10,\"\")","v":""},null,null,null,{"$f":"IF(AB$2=1,Klimadaten!AB10,\"\")","v":""},null,null,null,{"$f":"IF(AF$2=1,Klimadaten!AF10,\"\")","v":""},null,null,null,{"$f":"IF(AJ$2=1,Klimadaten!AJ10,\"\")","v":""},null,null,null,{"$f":"IF(AN$2=1,Klimadaten!AN10,\"\")","v":""},null,null,null,{"$f":"IF(AR$2=1,Klimadaten!AR10,\"\")","v":""},null,null,null,{"$f":"IF(AV$2=1,Klimadaten!AV10,\"\")","v":""},null,null,null,{"$f":"IF(AZ$2=1,Klimadaten!AZ10,\"\")","v":""},null,null,null,{"$f":"IF(BD$2=1,Klimadaten!BD10,\"\")","v":""},null,null,null,{"$f":"IF(BH$2=1,Klimadaten!BH10,\"\")","v":""},null,null,null,{"$f":"IF(BL$2=1,Klimadaten!BL10,\"\")","v":""},null,null,null,{"$f":"IF(BP$2=1,Klimadaten!BP10,\"\")","v":""},null,null,null,{"$f":"IF(BT$2=1,Klimadaten!BT10,\"\")","v":0},null,null,null,{"$f":"IF(BX$2=1,Klimadaten!BX10,\"\")","v":""},null,null,null,{"$f":"IF(CB$2=1,Klimadaten!CB10,\"\")","v":""},null,null,null,{"$f":"IF(CF$2=1,Klimadaten!CF10,\"\")","v":""},null,null,null,{"$f":"IF(CJ$2=1,Klimadaten!CJ10,\"\")","v":""},null,null,null,{"$f":"IF(CN$2=1,Klimadaten!CN10,\"\")","v":""},null,null,null,{"$f":"IF(CR$2=1,Klimadaten!CR10,\"\")","v":""},null,null,null,{"$f":"IF(CV$2=1,Klimadaten!CV10,\"\")","v":""},null,null,null,{"$f":"IF(CZ$2=1,Klimadaten!CZ10,\"\")","v":""},null,null,null,{"$f":"IF(DD$2=1,Klimadaten!DD10,\"\")","v":""},null,null,null,{"$f":"IF(DH$2=1,Klimadaten!DH10,\"\")","v":""},null,null,null,{"$f":"IF(DL$2=1,Klimadaten!DL10,\"\")","v":""},null,null,null,{"$f":"IF(DP$2=1,Klimadaten!DP10,\"\")","v":""},null,null,null,{"$f":"IF(DT$2=1,Klimadaten!DT10,\"\")","v":""},null,null,null,{"$f":"IF(DX$2=1,Klimadaten!DX10,\"\")","v":""},null,null,null,{"$f":"IF(EB$2=1,Klimadaten!EB10,\"\")","v":""},null,null,null,{"$f":"IF(EF$2=1,Klimadaten!EF10,\"\")","v":""},null,null,null,{"$f":"IF(EJ$2=1,Klimadaten!EJ10,\"\")","v":""},null,null,null,{"$f":"IF(EN$2=1,Klimadaten!EN10,\"\")","v":""},null,null,null,{"$f":"IF(ER$2=1,Klimadaten!ER10,\"\")","v":""},null,null,null,{"$f":"IF(EV$2=1,Klimadaten!EV10,\"\")","v":""},null,null,null,{"$f":"IF(EZ$2=1,Klimadaten!EZ10,\"\")","v":""},null,null,null,{"$f":"IF(FD$2=1,Klimadaten!FD10,\"\")","v":""},null,null,null,{"$f":"IF(FH$2=1,Klimadaten!FH10,\"\")","v":""},null,null,null,{"$f":"IF(FL$2=1,Klimadaten!FL10,\"\")","v":""},null,null,null,{"$f":"IF(FP$2=1,Klimadaten!FP10,\"\")","v":""},null,null,null,{"$f":"IF(FT$2=1,Klimadaten!FT10,\"\")","v":""},null,null,null,{"$f":"IF(FX$2=1,Klimadaten!FX10,\"\")","v":""},null,null,null,{"$f":"IF(GB$2=1,Klimadaten!GB10,\"\")","v":""},null,null,null,{"$f":"IF(GF$2=1,Klimadaten!GF10,\"\")","v":""},null,null,null,{"$f":"IF(GJ$2=1,Klimadaten!GJ10,\"\")","v":""},null,null,null,{"$f":"IF(GN$2=1,Klimadaten!GN10,\"\")","v":""},null,null,null,{"$f":"IF(GR$2=1,Klimadaten!GR10,\"\")","v":""},null,null,null,{"$f":"IF(GV$2=1,Klimadaten!GV10,\"\")","v":""},null,null,null,{"$f":"IF(GZ$2=1,Klimadaten!GZ10,\"\")","v":""},null,null,null,{"$f":"IF(HD$2=1,Klimadaten!HD10,\"\")","v":""},null,null,null,{"$f":"IF(HH$2=1,Klimadaten!HH10,\"\")","v":""},null,null,null,{"$f":"IF(HL$2=1,Klimadaten!HL10,\"\")","v":""},null,null,null,{"$f":"IF(HP$2=1,Klimadaten!HP10,\"\")","v":""},null,null,null,{"$f":"IF(HT$2=1,Klimadaten!HT10,\"\")","v":""},null,null,null,{"$f":"IF(HX$2=1,Klimadaten!HX10,\"\")","v":""},null,null,null,{"$f":"IF(IB$2=1,Klimadaten!IB10,\"\")","v":0},null,null,null,{"$f":"IF(IF$2=1,Klimadaten!IF10,\"\")","v":""},null,null,null,{"$f":"IF(IJ$2=1,Klimadaten!IJ10,\"\")","v":""},null,null,null,{"$f":"IF(IN$2=1,Klimadaten!IN10,\"\")","v":""},null,null,null,{"$f":"IF(IR$2=1,Klimadaten!IR10,\"\")","v":""},null,null,null,{"$f":"IF(IV$2=1,Klimadaten!IV10,\"\")","v":""},null,null,null,{"$f":"IF(IZ$2=1,Klimadaten!IZ10,\"\")","v":""},null,null,null,{"$f":"IF(JD$2=1,Klimadaten!JD10,\"\")","v":""},null,null,null,{"$f":"IF(JH$2=1,Klimadaten!JH10,\"\")","v":""},null,null,null,{"$f":"IF(JL$2=1,Klimadaten!JL10,\"\")","v":""}]
[-19,null,null,{"$f":"IF(D$2=1,Klimadaten!D11,\"\")","v":0},null,null,null,{"$f":"IF(H$2=1,Klimadaten!H11,\"\")","v":""},null,null,null,{"$f":"IF(L$2=1,Klimadaten!L11,\"\")","v":""},null,null,null,{"$f":"IF(P$2=1,Klimadaten!P11,\"\")","v":0},null,null,null,{"$f":"IF(T$2=1,Klimadaten!T11,\"\")","v":""},null,null,null,{"$f":"IF(X$2=1,Klimadaten!X11,\"\")","v":""},null,null,null,{"$f":"IF(AB$2=1,Klimadaten!AB11,\"\")","v":""},null,null,null,{"$f":"IF(AF$2=1,Klimadaten!AF11,\"\")","v":""},null,null,null,{"$f":"IF(AJ$2=1,Klimadaten!AJ11,\"\")","v":""},null,null,null,{"$f":"IF(AN$2=1,Klimadaten!AN11,\"\")","v":""},null,null,null,{"$f":"IF(AR$2=1,Klimadaten!AR11,\"\")","v":""},null,null,null,{"$f":"IF(AV$2=1,Klimadaten!AV11,\"\")","v":""},null,null,null,{"$f":"IF(AZ$2=1,Klimadaten!AZ11,\"\")","v":""},null,null,null,{"$f":"IF(BD$2=1,Klimadaten!BD11,\"\")","v":""},null,null,null,{"$f":"IF(BH$2=1,Klimadaten!BH11,\"\")","v":""},null,null,null,{"$f":"IF(BL$2=1,Klimadaten!BL11,\"\")","v":""},null,null,null,{"$f":"IF(BP$2=1,Klimadaten!BP11,\"\")","v":""},null,null,null,{"$f":"IF(BT$2=1,Klimadaten!BT11,\"\")","v":0},null,null,null,{"$f":"IF(BX$2=1,Klimadaten!BX11,\"\")","v":""},null,null,null,{"$f":"IF(CB$2=1,Klimadaten!CB11,\"\")","v":""},null,null,null,{"$f":"IF(CF$2=1,Klimadaten!CF11,\"\")","v":""},null,null,null,{"$f":"IF(CJ$2=1,Klimadaten!CJ11,\"\")","v":""},null,null,null,{"$f":"IF(CN$2=1,Klimadaten!CN11,\"\")","v":""},null,null,null,{"$f":"IF(CR$2=1,Klimadaten!CR11,\"\")","v":""},null,null,null,{"$f":"IF(CV$2=1,Klimadaten!CV11,\"\")","v":""},null,null,null,{"$f":"IF(CZ$2=1,Klimadaten!CZ11,\"\")","v":""},null,null,null,{"$f":"IF(DD$2=1,Klimadaten!DD11,\"\")","v":""},null,null,null,{"$f":"IF(DH$2=1,Klimadaten!DH11,\"\")","v":""},null,null,null,{"$f":"IF(DL$2=1,Klimadaten!DL11,\"\")","v":""},null,null,null,{"$f":"IF(DP$2=1,Klimadaten!DP11,\"\")","v":""},null,null,null,{"$f":"IF(DT$2=1,Klimadaten!DT11,\"\")","v":""},null,null,null,{"$f":"IF(DX$2=1,Klimadaten!DX11,\"\")","v":""},null,null,null,{"$f":"IF(EB$2=1,Klimadaten!EB11,\"\")","v":""},null,null,null,{"$f":"IF(EF$2=1,Klimadaten!EF11,\"\")","v":""},null,null,null,{"$f":"IF(EJ$2=1,Klimadaten!EJ11,\"\")","v":""},null,null,null,{"$f":"IF(EN$2=1,Klimadaten!EN11,\"\")","v":""},null,null,null,{"$f":"IF(ER$2=1,Klimadaten!ER11,\"\")","v":""},null,null,null,{"$f":"IF(EV$2=1,Klimadaten!EV11,\"\")","v":""},null,null,null,{"$f":"IF(EZ$2=1,Klimadaten!EZ11,\"\")","v":""},null,null,null,{"$f":"IF(FD$2=1,Klimadaten!FD11,\"\")","v":""},null,null,null,{"$f":"IF(FH$2=1,Klimadaten!FH11,\"\")","v":""},null,null,null,{"$f":"IF(FL$2=1,Klimadaten!FL11,\"\")","v":""},null,null,null,{"$f":"IF(FP$2=1,Klimadaten!FP11,\"\")","v":""},null,null,null,{"$f":"IF(FT$2=1,Klimadaten!FT11,\"\")","v":""},null,null,null,{"$f":"IF(FX$2=1,Klimadaten!FX11,\"\")","v":""},null,null,null,{"$f":"IF(GB$2=1,Klimadaten!GB11,\"\")","v":""},null,null,null,{"$f":"IF(GF$2=1,Klimadaten!GF11,\"\")","v":""},null,null,null,{"$f":"IF(GJ$2=1,Klimadaten!GJ11,\"\")","v":""},null,null,null,{"$f":"IF(GN$2=1,Klimadaten!GN11,\"\")","v":""},null,null,null,{"$f":"IF(GR$2=1,Klimadaten!GR11,\"\")","v":""},null,null,null,{"$f":"IF(GV$2=1,Klimadaten!GV11,\"\")","v":""},null,null,null,{"$f":"IF(GZ$2=1,Klimadaten!GZ11,\"\")","v":""},null,null,null,{"$f":"IF(HD$2=1,Klimadaten!HD11,\"\")","v":""},null,null,null,{"$f":"IF(HH$2=1,Klimadaten!HH11,\"\")","v":""},null,null,null,{"$f":"IF(HL$2=1,Klimadaten!HL11,\"\")","v":""},null,null,null,{"$f":"IF(HP$2=1,Klimadaten!HP11,\"\")","v":""},null,null,null,{"$f":"IF(HT$2=1,Klimadaten!HT11,\"\")","v":""},null,null,null,{"$f":"IF(HX$2=1,Klimadaten!HX11,\"\")","v":""},null,null,null,{"$f":"IF(IB$2=1,Klimadaten!IB11,\"\")","v":0},null,null,null,{"$f":"IF(IF$2=1,Klimadaten!IF11,\"\")","v":""},null,null,null,{"$f":"IF(IJ$2=1,Klimadaten!IJ11,\"\")","v":""},null,null,null,{"$f":"IF(IN$2=1,Klimadaten!IN11,\"\")","v":""},null,null,null,{"$f":"IF(IR$2=1,Klimadaten!IR11,\"\")","v":""},null,null,null,{"$f":"IF(IV$2=1,Klimadaten!IV11,\"\")","v":""},null,null,null,{"$f":"IF(IZ$2=1,Klimadaten!IZ11,\"\")","v":""},null,null,null,{"$f":"IF(JD$2=1,Klimadaten!JD11,\"\")","v":""},null,null,null,{"$f":"IF(JH$2=1,Klimadaten!JH11,\"\")","v":""},null,null,null,{"$f":"IF(JL$2=1,Klimadaten!JL11,\"\")","v":""}]
[-18,null,null,{"$f":"IF(D$2=1,Klimadaten!D12,\"\")","v":0},null,null,null,{"$f":"IF(H$2=1,Klimadaten!H12,\"\")","v":""},null,null,null,{"$f":"IF(L$2=1,Klimadaten!L12,\"\")","v":""},null,null,null,{"$f":"IF(P$2=1,Klimadaten!P12,\"\")","v":0},null,null,null,{"$f":"IF(T$2=1,Klimadaten!T12,\"\")","v":""},null,null,null,{"$f":"IF(X$2=1,Klimadaten!X12,\"\")","v":""},null,null,null,{"$f":"IF(AB$2=1,Klimadaten!AB12,\"\")","v":""},null,null,null,{"$f":"IF(AF$2=1,Klimadaten!AF12,\"\")","v":""},null,null,null,{"$f":"IF(AJ$2=1,Klimadaten!AJ12,\"\")","v":""},null,null,null,{"$f":"IF(AN$2=1,Klimadaten!AN12,\"\")","v":""},null,null,null,{"$f":"IF(AR$2=1,Klimadaten!AR12,\"\")","v":""},null,null,null,{"$f":"IF(AV$2=1,Klimadaten!AV12,\"\")","v":""},null,null,null,{"$f":"IF(AZ$2=1,Klimadaten!AZ12,\"\")","v":""},null,null,null,{"$f":"IF(BD$2=1,Klimadaten!BD12,\"\")","v":""},null,null,null,{"$f":"IF(BH$2=1,Klimadaten!BH12,\"\")","v":""},null,null,null,{"$f":"IF(BL$2=1,Klimadaten!BL12,\"\")","v":""},null,null,null,{"$f":"IF(BP$2=1,Klimadaten!BP12,\"\")","v":""},null,null,null,{"$f":"IF(BT$2=1,Klimadaten!BT12,\"\")","v":0},null,null,null,{"$f":"IF(BX$2=1,Klimadaten!BX12,\"\")","v":""},null,null,null,{"$f":"IF(CB$2=1,Klimadaten!CB12,\"\")","v":""},null,null,null,{"$f":"IF(CF$2=1,Klimadaten!CF12,\"\")","v":""},null,null,null,{"$f":"IF(CJ$2=1,Klimadaten!CJ12,\"\")","v":""},null,null,null,{"$f":"IF(CN$2=1,Klimadaten!CN12,\"\")","v":""},null,null,null,{"$f":"IF(CR$2=1,Klimadaten!CR12,\"\")","v":""},null,null,null,{"$f":"IF(CV$2=1,Klimadaten!CV12,\"\")","v":""},null,null,null,{"$f":"IF(CZ$2=1,Klimadaten!CZ12,\"\")","v":""},null,null,null,{"$f":"IF(DD$2=1,Klimadaten!DD12,\"\")","v":""},null,null,null,{"$f":"IF(DH$2=1,Klimadaten!DH12,\"\")","v":""},null,null,null,{"$f":"IF(DL$2=1,Klimadaten!DL12,\"\")","v":""},null,null,null,{"$f":"IF(DP$2=1,Klimadaten!DP12,\"\")","v":""},null,null,null,{"$f":"IF(DT$2=1,Klimadaten!DT12,\"\")","v":""},null,null,null,{"$f":"IF(DX$2=1,Klimadaten!DX12,\"\")","v":""},null,null,null,{"$f":"IF(EB$2=1,Klimadaten!EB12,\"\")","v":""},null,null,null,{"$f":"IF(EF$2=1,Klimadaten!EF12,\"\")","v":""},null,null,null,{"$f":"IF(EJ$2=1,Klimadaten!EJ12,\"\")","v":""},null,null,null,{"$f":"IF(EN$2=1,Klimadaten!EN12,\"\")","v":""},null,null,null,{"$f":"IF(ER$2=1,Klimadaten!ER12,\"\")","v":""},null,null,null,{"$f":"IF(EV$2=1,Klimadaten!EV12,\"\")","v":""},null,null,null,{"$f":"IF(EZ$2=1,Klimadaten!EZ12,\"\")","v":""},null,null,null,{"$f":"IF(FD$2=1,Klimadaten!FD12,\"\")","v":""},null,null,null,{"$f":"IF(FH$2=1,Klimadaten!FH12,\"\")","v":""},null,null,null,{"$f":"IF(FL$2=1,Klimadaten!FL12,\"\")","v":""},null,null,null,{"$f":"IF(FP$2=1,Klimadaten!FP12,\"\")","v":""},null,null,null,{"$f":"IF(FT$2=1,Klimadaten!FT12,\"\")","v":""},null,null,null,{"$f":"IF(FX$2=1,Klimadaten!FX12,\"\")","v":""},null,null,null,{"$f":"IF(GB$2=1,Klimadaten!GB12,\"\")","v":""},null,null,null,{"$f":"IF(GF$2=1,Klimadaten!GF12,\"\")","v":""},null,null,null,{"$f":"IF(GJ$2=1,Klimadaten!GJ12,\"\")","v":""},null,null,null,{"$f":"IF(GN$2=1,Klimadaten!GN12,\"\")","v":""},null,null,null,{"$f":"IF(GR$2=1,Klimadaten!GR12,\"\")","v":""},null,null,null,{"$f":"IF(GV$2=1,Klimadaten!GV12,\"\")","v":""},null,null,null,{"$f":"IF(GZ$2=1,Klimadaten!GZ12,\"\")","v":""},null,null,null,{"$f":"IF(HD$2=1,Klimadaten!HD12,\"\")","v":""},null,null,null,{"$f":"IF(HH$2=1,Klimadaten!HH12,\"\")","v":""},null,null,null,{"$f":"IF(HL$2=1,Klimadaten!HL12,\"\")","v":""},null,null,null,{"$f":"IF(HP$2=1,Klimadaten!HP12,\"\")","v":""},null,null,null,{"$f":"IF(HT$2=1,Klimadaten!HT12,\"\")","v":""},null,null,null,{"$f":"IF(HX$2=1,Klimadaten!HX12,\"\")","v":""},null,null,null,{"$f":"IF(IB$2=1,Klimadaten!IB12,\"\")","v":0},null,null,null,{"$f":"IF(IF$2=1,Klimadaten!IF12,\"\")","v":""},null,null,null,{"$f":"IF(IJ$2=1,Klimadaten!IJ12,\"\")","v":""},null,null,null,{"$f":"IF(IN$2=1,Klimadaten!IN12,\"\")","v":""},null,null,null,{"$f":"IF(IR$2=1,Klimadaten!IR12,\"\")","v":""},null,null,null,{"$f":"IF(IV$2=1,Klimadaten!IV12,\"\")","v":""},null,null,null,{"$f":"IF(IZ$2=1,Klimadaten!IZ12,\"\")","v":""},null,null,null,{"$f":"IF(JD$2=1,Klimadaten!JD12,\"\")","v":""},null,null,null,{"$f":"IF(JH$2=1,Klimadaten!JH12,\"\")","v":""},null,null,null,{"$f":"IF(JL$2=1,Klimadaten!JL12,\"\")","v":""}]
[-17,null,null,{"$f":"IF(D$2=1,Klimadaten!D13,\"\")","v":0},null,null,null,{"$f":"IF(H$2=1,Klimadaten!H13,\"\")","v":""},null,null,null,{"$f":"IF(L$2=1,Klimadaten!L13,\"\")","v":""},null,null,null,{"$f":"IF(P$2=1,Klimadaten!P13,\"\")","v":0},null,null,null,{"$f":"IF(T$2=1,Klimadaten!T13,\"\")","v":""},null,null,null,{"$f":"IF(X$2=1,Klimadaten!X13,\"\")","v":""},null,null,null,{"$f":"IF(AB$2=1,Klimadaten!AB13,\"\")","v":""},null,null,null,{"$f":"IF(AF$2=1,Klimadaten!AF13,\"\")","v":""},null,null,null,{"$f":"IF(AJ$2=1,Klimadaten!AJ13,\"\")","v":""},null,null,null,{"$f":"IF(AN$2=1,Klimadaten!AN13,\"\")","v":""},null,null,null,{"$f":"IF(AR$2=1,Klimadaten!AR13,\"\")","v":""},null,null,null,{"$f":"IF(AV$2=1,Klimadaten!AV13,\"\")","v":""},null,null,null,{"$f":"IF(AZ$2=1,Klimadaten!AZ13,\"\")","v":""},null,null,null,{"$f":"IF(BD$2=1,Klimadaten!BD13,\"\")","v":""},null,null,null,{"$f":"IF(BH$2=1,Klimadaten!BH13,\"\")","v":""},null,null,null,{"$f":"IF(BL$2=1,Klimadaten!BL13,\"\")","v":""},null,null,null,{"$f":"IF(BP$2=1,Klimadaten!BP13,\"\")","v":""},null,null,null,{"$f":"IF(BT$2=1,Klimadaten!BT13,\"\")","v":0},null,null,null,{"$f":"IF(BX$2=1,Klimadaten!BX13,\"\")","v":""},null,null,null,{"$f":"IF(CB$2=1,Klimadaten!CB13,\"\")","v":""},null,null,null,{"$f":"IF(CF$2=1,Klimadaten!CF13,\"\")","v":""},null,null,null,{"$f":"IF(CJ$2=1,Klimadaten!CJ13,\"\")","v":""},null,null,null,{"$f":"IF(CN$2=1,Klimadaten!CN13,\"\")","v":""},null,null,null,{"$f":"IF(CR$2=1,Klimadaten!CR13,\"\")","v":""},null,null,null,{"$f":"IF(CV$2=1,Klimadaten!CV13,\"\")","v":""},null,null,null,{"$f":"IF(CZ$2=1,Klimadaten!CZ13,\"\")","v":""},null,null,null,{"$f":"IF(DD$2=1,Klimadaten!DD13,\"\")","v":""},null,null,null,{"$f":"IF(DH$2=1,Klimadaten!DH13,\"\")","v":""},null,null,null,{"$f":"IF(DL$2=1,Klimadaten!DL13,\"\")","v":""},null,null,null,{"$f":"IF(DP$2=1,Klimadaten!DP13,\"\")","v":""},null,null,null,{"$f":"IF(DT$2=1,Klimadaten!DT13,\"\")","v":""},null,null,null,{"$f":"IF(DX$2=1,Klimadaten!DX13,\"\")","v":""},null,null,null,{"$f":"IF(EB$2=1,Klimadaten!EB13,\"\")","v":""},null,null,null,{"$f":"IF(EF$2=1,Klimadaten!EF13,\"\")","v":""},null,null,null,{"$f":"IF(EJ$2=1,Klimadaten!EJ13,\"\")","v":""},null,null,null,{"$f":"IF(EN$2=1,Klimadaten!EN13,\"\")","v":""},null,null,null,{"$f":"IF(ER$2=1,Klimadaten!ER13,\"\")","v":""},null,null,null,{"$f":"IF(EV$2=1,Klimadaten!EV13,\"\")","v":""},null,null,null,{"$f":"IF(EZ$2=1,Klimadaten!EZ13,\"\")","v":""},null,null,null,{"$f":"IF(FD$2=1,Klimadaten!FD13,\"\")","v":""},null,null,null,{"$f":"IF(FH$2=1,Klimadaten!FH13,\"\")","v":""},null,null,null,{"$f":"IF(FL$2=1,Klimadaten!FL13,\"\")","v":""},null,null,null,{"$f":"IF(FP$2=1,Klimadaten!FP13,\"\")","v":""},null,null,null,{"$f":"IF(FT$2=1,Klimadaten!FT13,\"\")","v":""},null,null,null,{"$f":"IF(FX$2=1,Klimadaten!FX13,\"\")","v":""},null,null,null,{"$f":"IF(GB$2=1,Klimadaten!GB13,\"\")","v":""},null,null,null,{"$f":"IF(GF$2=1,Klimadaten!GF13,\"\")","v":""},null,null,null,{"$f":"IF(GJ$2=1,Klimadaten!GJ13,\"\")","v":""},null,null,null,{"$f":"IF(GN$2=1,Klimadaten!GN13,\"\")","v":""},null,null,null,{"$f":"IF(GR$2=1,Klimadaten!GR13,\"\")","v":""},null,null,null,{"$f":"IF(GV$2=1,Klimadaten!GV13,\"\")","v":""},null,null,null,{"$f":"IF(GZ$2=1,Klimadaten!GZ13,\"\")","v":""},null,null,null,{"$f":"IF(HD$2=1,Klimadaten!HD13,\"\")","v":""},null,null,null,{"$f":"IF(HH$2=1,Klimadaten!HH13,\"\")","v":""},null,null,null,{"$f":"IF(HL$2=1,Klimadaten!HL13,\"\")","v":""},null,null,null,{"$f":"IF(HP$2=1,Klimadaten!HP13,\"\")","v":""},null,null,null,{"$f":"IF(HT$2=1,Klimadaten!HT13,\"\")","v":""},null,null,null,{"$f":"IF(HX$2=1,Klimadaten!HX13,\"\")","v":""},null,null,null,{"$f":"IF(IB$2=1,Klimadaten!IB13,\"\")","v":0},null,null,null,{"$f":"IF(IF$2=1,Klimadaten!IF13,\"\")","v":""},null,null,null,{"$f":"IF(IJ$2=1,Klimadaten!IJ13,\"\")","v":""},null,null,null,{"$f":"IF(IN$2=1,Klimadaten!IN13,\"\")","v":""},null,null,null,{"$f":"IF(IR$2=1,Klimadaten!IR13,\"\")","v":""},null,null,null,{"$f":"IF(IV$2=1,Klimadaten!IV13,\"\")","v":""},null,null,null,{"$f":"IF(IZ$2=1,Klimadaten!IZ13,\"\")","v":""},null,null,null,{"$f":"IF(JD$2=1,Klimadaten!JD13,\"\")","v":""},null,null,null,{"$f":"IF(JH$2=1,Klimadaten!JH13,\"\")","v":""},null,null,null,{"$f":"IF(JL$2=1,Klimadaten!JL13,\"\")","v":""}]
[-16,null,null,{"$f":"IF(D$2=1,Klimadaten!D14,\"\")","v":0},null,null,null,{"$f":"IF(H$2=1,Klimadaten!H14,\"\")","v":""},null,null,null,{"$f":"IF(L$2=1,Klimadaten!L14,\"\")","v":""},null,null,null,{"$f":"IF(P$2=1,Klimadaten!P14,\"\")","v":0},null,null,null,{"$f":"IF(T$2=1,Klimadaten!T14,\"\")","v":""},null,null,null,{"$f":"IF(X$2=1,Klimadaten!X14,\"\")","v":""},null,null,null,{"$f":"IF(AB$2=1,Klimadaten!AB14,\"\")","v":""},null,null,null,{"$f":"IF(AF$2=1,Klimadaten!AF14,\"\")","v":""},null,null,null,{"$f":"IF(AJ$2=1,Klimadaten!AJ14,\"\")","v":""},null,null,null,{"$f":"IF(AN$2=1,Klimadaten!AN14,\"\")","v":""},null,null,null,{"$f":"IF(AR$2=1,Klimadaten!AR14,\"\")","v":""},null,null,null,{"$f":"IF(AV$2=1,Klimadaten!AV14,\"\")","v":""},null,null,null,{"$f":"IF(AZ$2=1,Klimadaten!AZ14,\"\")","v":""},null,null,null,{"$f":"IF(BD$2=1,Klimadaten!BD14,\"\")","v":""},null,null,null,{"$f":"IF(BH$2=1,Klimadaten!BH14,\"\")","v":""},null,null,null,{"$f":"IF(BL$2=1,Klimadaten!BL14,\"\")","v":""},null,null,null,{"$f":"IF(BP$2=1,Klimadaten!BP14,\"\")","v":""},null,null,null,{"$f":"IF(BT$2=1,Klimadaten!BT14,\"\")","v":0},null,null,null,{"$f":"IF(BX$2=1,Klimadaten!BX14,\"\")","v":""},null,null,null,{"$f":"IF(CB$2=1,Klimadaten!CB14,\"\")","v":""},null,null,null,{"$f":"IF(CF$2=1,Klimadaten!CF14,\"\")","v":""},null,null,null,{"$f":"IF(CJ$2=1,Klimadaten!CJ14,\"\")","v":""},null,null,null,{"$f":"IF(CN$2=1,Klimadaten!CN14,\"\")","v":""},null,null,null,{"$f":"IF(CR$2=1,Klimadaten!CR14,\"\")","v":""},null,null,null,{"$f":"IF(CV$2=1,Klimadaten!CV14,\"\")","v":""},null,null,null,{"$f":"IF(CZ$2=1,Klimadaten!CZ14,\"\")","v":""},null,null,null,{"$f":"IF(DD$2=1,Klimadaten!DD14,\"\")","v":""},null,null,null,{"$f":"IF(DH$2=1,Klimadaten!DH14,\"\")","v":""},null,null,null,{"$f":"IF(DL$2=1,Klimadaten!DL14,\"\")","v":""},null,null,null,{"$f":"IF(DP$2=1,Klimadaten!DP14,\"\")","v":""},null,null,null,{"$f":"IF(DT$2=1,Klimadaten!DT14,\"\")","v":""},null,null,null,{"$f":"IF(DX$2=1,Klimadaten!DX14,\"\")","v":""},null,null,null,{"$f":"IF(EB$2=1,Klimadaten!EB14,\"\")","v":""},null,null,null,{"$f":"IF(EF$2=1,Klimadaten!EF14,\"\")","v":""},null,null,null,{"$f":"IF(EJ$2=1,Klimadaten!EJ14,\"\")","v":""},null,null,null,{"$f":"IF(EN$2=1,Klimadaten!EN14,\"\")","v":""},null,null,null,{"$f":"IF(ER$2=1,Klimadaten!ER14,\"\")","v":""},null,null,null,{"$f":"IF(EV$2=1,Klimadaten!EV14,\"\")","v":""},null,null,null,{"$f":"IF(EZ$2=1,Klimadaten!EZ14,\"\")","v":""},null,null,null,{"$f":"IF(FD$2=1,Klimadaten!FD14,\"\")","v":""},null,null,null,{"$f":"IF(FH$2=1,Klimadaten!FH14,\"\")","v":""},null,null,null,{"$f":"IF(FL$2=1,Klimadaten!FL14,\"\")","v":""},null,null,null,{"$f":"IF(FP$2=1,Klimadaten!FP14,\"\")","v":""},null,null,null,{"$f":"IF(FT$2=1,Klimadaten!FT14,\"\")","v":""},null,null,null,{"$f":"IF(FX$2=1,Klimadaten!FX14,\"\")","v":""},null,null,null,{"$f":"IF(GB$2=1,Klimadaten!GB14,\"\")","v":""},null,null,null,{"$f":"IF(GF$2=1,Klimadaten!GF14,\"\")","v":""},null,null,null,{"$f":"IF(GJ$2=1,Klimadaten!GJ14,\"\")","v":""},null,null,null,{"$f":"IF(GN$2=1,Klimadaten!GN14,\"\")","v":""},null,null,null,{"$f":"IF(GR$2=1,Klimadaten!GR14,\"\")","v":""},null,null,null,{"$f":"IF(GV$2=1,Klimadaten!GV14,\"\")","v":""},null,null,null,{"$f":"IF(GZ$2=1,Klimadaten!GZ14,\"\")","v":""},null,null,null,{"$f":"IF(HD$2=1,Klimadaten!HD14,\"\")","v":""},null,null,null,{"$f":"IF(HH$2=1,Klimadaten!HH14,\"\")","v":""},null,null,null,{"$f":"IF(HL$2=1,Klimadaten!HL14,\"\")","v":""},null,null,null,{"$f":"IF(HP$2=1,Klimadaten!HP14,\"\")","v":""},null,null,null,{"$f":"IF(HT$2=1,Klimadaten!HT14,\"\")","v":""},null,null,null,{"$f":"IF(HX$2=1,Klimadaten!HX14,\"\")","v":""},null,null,null,{"$f":"IF(IB$2=1,Klimadaten!IB14,\"\")","v":0},null,null,null,{"$f":"IF(IF$2=1,Klimadaten!IF14,\"\")","v":""},null,null,null,{"$f":"IF(IJ$2=1,Klimadaten!IJ14,\"\")","v":""},null,null,null,{"$f":"IF(IN$2=1,Klimadaten!IN14,\"\")","v":""},null,null,null,{"$f":"IF(IR$2=1,Klimadaten!IR14,\"\")","v":""},null,null,null,{"$f":"IF(IV$2=1,Klimadaten!IV14,\"\")","v":""},null,null,null,{"$f":"IF(IZ$2=1,Klimadaten!IZ14,\"\")","v":""},null,null,null,{"$f":"IF(JD$2=1,Klimadaten!JD14,\"\")","v":""},null,null,null,{"$f":"IF(JH$2=1,Klimadaten!JH14,\"\")","v":""},null,null,null,{"$f":"IF(JL$2=1,Klimadaten!JL14,\"\")","v":""}]
[-15,null,null,{"$f":"IF(D$2=1,Klimadaten!D15,\"\")","v":0},null,null,null,{"$f":"IF(H$2=1,Klimadaten!H15,\"\")","v":""},null,null,null,{"$f":"IF(L$2=1,Klimadaten!L15,\"\")","v":""},null,null,null,{"$f":"IF(P$2=1,Klimadaten!P15,\"\")","v":0},null,null,null,{"$f":"IF(T$2=1,Klimadaten!T15,\"\")","v":""},null,null,null,{"$f":"IF(X$2=1,Klimadaten!X15,\"\")","v":""},null,null,null,{"$f":"IF(AB$2=1,Klimadaten!AB15,\"\")","v":""},null,null,null,{"$f":"IF(AF$2=1,Klimadaten!AF15,\"\")","v":""},null,null,null,{"$f":"IF(AJ$2=1,Klimadaten!AJ15,\"\")","v":""},null,null,null,{"$f":"IF(AN$2=1,Klimadaten!AN15,\"\")","v":""},null,null,null,{"$f":"IF(AR$2=1,Klimadaten!AR15,\"\")","v":""},null,null,null,{"$f":"IF(AV$2=1,Klimadaten!AV15,\"\")","v":""},null,null,null,{"$f":"IF(AZ$2=1,Klimadaten!AZ15,\"\")","v":""},null,null,null,{"$f":"IF(BD$2=1,Klimadaten!BD15,\"\")","v":""},null,null,null,{"$f":"IF(BH$2=1,Klimadaten!BH15,\"\")","v":""},null,null,null,{"$f":"IF(BL$2=1,Klimadaten!BL15,\"\")","v":""},null,null,null,{"$f":"IF(BP$2=1,Klimadaten!BP15,\"\")","v":""},null,null,null,{"$f":"IF(BT$2=1,Klimadaten!BT15,\"\")","v":0},null,null,null,{"$f":"IF(BX$2=1,Klimadaten!BX15,\"\")","v":""},null,null,null,{"$f":"IF(CB$2=1,Klimadaten!CB15,\"\")","v":""},null,null,null,{"$f":"IF(CF$2=1,Klimadaten!CF15,\"\")","v":""},null,null,null,{"$f":"IF(CJ$2=1,Klimadaten!CJ15,\"\")","v":""},null,null,null,{"$f":"IF(CN$2=1,Klimadaten!CN15,\"\")","v":""},null,null,null,{"$f":"IF(CR$2=1,Klimadaten!CR15,\"\")","v":""},null,null,null,{"$f":"IF(CV$2=1,Klimadaten!CV15,\"\")","v":""},null,null,null,{"$f":"IF(CZ$2=1,Klimadaten!CZ15,\"\")","v":""},null,null,null,{"$f":"IF(DD$2=1,Klimadaten!DD15,\"\")","v":""},null,null,null,{"$f":"IF(DH$2=1,Klimadaten!DH15,\"\")","v":""},null,null,null,{"$f":"IF(DL$2=1,Klimadaten!DL15,\"\")","v":""},null,null,null,{"$f":"IF(DP$2=1,Klimadaten!DP15,\"\")","v":""},null,null,null,{"$f":"IF(DT$2=1,Klimadaten!DT15,\"\")","v":""},null,null,null,{"$f":"IF(DX$2=1,Klimadaten!DX15,\"\")","v":""},null,null,null,{"$f":"IF(EB$2=1,Klimadaten!EB15,\"\")","v":""},null,null,null,{"$f":"IF(EF$2=1,Klimadaten!EF15,\"\")","v":""},null,null,null,{"$f":"IF(EJ$2=1,Klimadaten!EJ15,\"\")","v":""},null,null,null,{"$f":"IF(EN$2=1,Klimadaten!EN15,\"\")","v":""},null,null,null,{"$f":"IF(ER$2=1,Klimadaten!ER15,\"\")","v":""},null,null,null,{"$f":"IF(EV$2=1,Klimadaten!EV15,\"\")","v":""},null,null,null,{"$f":"IF(EZ$2=1,Klimadaten!EZ15,\"\")","v":""},null,null,null,{"$f":"IF(FD$2=1,Klimadaten!FD15,\"\")","v":""},null,null,null,{"$f":"IF(FH$2=1,Klimadaten!FH15,\"\")","v":""},null,null,null,{"$f":"IF(FL$2=1,Klimadaten!FL15,\"\")","v":""},null,null,null,{"$f":"IF(FP$2=1,Klimadaten!FP15,\"\")","v":""},null,null,null,{"$f":"IF(FT$2=1,Klimadaten!FT15,\"\")","v":""},null,null,null,{"$f":"IF(FX$2=1,Klimadaten!FX15,\"\")","v":""},null,null,null,{"$f":"IF(GB$2=1,Klimadaten!GB15,\"\")","v":""},null,null,null,{"$f":"IF(GF$2=1,Klimadaten!GF15,\"\")","v":""},null,null,null,{"$f":"IF(GJ$2=1,Klimadaten!GJ15,\"\")","v":""},null,null,null,{"$f":"IF(GN$2=1,Klimadaten!GN15,\"\")","v":""},null,null,null,{"$f":"IF(GR$2=1,Klimadaten!GR15,\"\")","v":""},null,null,null,{"$f":"IF(GV$2=1,Klimadaten!GV15,\"\")","v":""},null,null,null,{"$f":"IF(GZ$2=1,Klimadaten!GZ15,\"\")","v":""},null,null,null,{"$f":"IF(HD$2=1,Klimadaten!HD15,\"\")","v":""},null,null,null,{"$f":"IF(HH$2=1,Klimadaten!HH15,\"\")","v":""},null,null,null,{"$f":"IF(HL$2=1,Klimadaten!HL15,\"\")","v":""},null,null,null,{"$f":"IF(HP$2=1,Klimadaten!HP15,\"\")","v":""},null,null,null,{"$f":"IF(HT$2=1,Klimadaten!HT15,\"\")","v":""},null,null,null,{"$f":"IF(HX$2=1,Klimadaten!HX15,\"\")","v":""},null,null,null,{"$f":"IF(IB$2=1,Klimadaten!IB15,\"\")","v":0},null,null,null,{"$f":"IF(IF$2=1,Klimadaten!IF15,\"\")","v":""},null,null,null,{"$f":"IF(IJ$2=1,Klimadaten!IJ15,\"\")","v":""},null,null,null,{"$f":"IF(IN$2=1,Klimadaten!IN15,\"\")","v":""},null,null,null,{"$f":"IF(IR$2=1,Klimadaten!IR15,\"\")","v":""},null,null,null,{"$f":"IF(IV$2=1,Klimadaten!IV15,\"\")","v":""},null,null,null,{"$f":"IF(IZ$2=1,Klimadaten!IZ15,\"\")","v":""},null,null,null,{"$f":"IF(JD$2=1,Klimadaten!JD15,\"\")","v":""},null,null,null,{"$f":"IF(JH$2=1,Klimadaten!JH15,\"\")","v":""},null,null,null,{"$f":"IF(JL$2=1,Klimadaten!JL15,\"\")","v":""}]
[-14,null,null,{"$f":"IF(D$2=1,Klimadaten!D16,\"\")","v":1},null,null,null,{"$f":"IF(H$2=1,Klimadaten!H16,\"\")","v":""},null,null,null,{"$f":"IF(L$2=1,Klimadaten!L16,\"\")","v":""},null,null,null,{"$f":"IF(P$2=1,Klimadaten!P16,\"\")","v":0},null,null,null,{"$f":"IF(T$2=1,Klimadaten!T16,\"\")","v":""},null,null,null,{"$f":"IF(X$2=1,Klimadaten!X16,\"\")","v":""},null,null,null,{"$f":"IF(AB$2=1,Klimadaten!AB16,\"\")","v":""},null,null,null,{"$f":"IF(AF$2=1,Klimadaten!AF16,\"\")","v":""},null,null,null,{"$f":"IF(AJ$2=1,Klimadaten!AJ16,\"\")","v":""},null,null,null,{"$f":"IF(AN$2=1,Klimadaten!AN16,\"\")","v":""},null,null,null,{"$f":"IF(AR$2=1,Klimadaten!AR16,\"\")","v":""},null,null,null,{"$f":"IF(AV$2=1,Klimadaten!AV16,\"\")","v":""},null,null,null,{"$f":"IF(AZ$2=1,Klimadaten!AZ16,\"\")","v":""},null,null,null,{"$f":"IF(BD$2=1,Klimadaten!BD16,\"\")","v":""},null,null,null,{"$f":"IF(BH$2=1,Klimadaten!BH16,\"\")","v":""},null,null,null,{"$f":"IF(BL$2=1,Klimadaten!BL16,\"\")","v":""},null,null,null,{"$f":"IF(BP$2=1,Klimadaten!BP16,\"\")","v":""},null,null,null,{"$f":"IF(BT$2=1,Klimadaten!BT16,\"\")","v":0},null,null,null,{"$f":"IF(BX$2=1,Klimadaten!BX16,\"\")","v":""},null,null,null,{"$f":"IF(CB$2=1,Klimadaten!CB16,\"\")","v":""},null,null,null,{"$f":"IF(CF$2=1,Klimadaten!CF16,\"\")","v":""},null,null,null,{"$f":"IF(CJ$2=1,Klimadaten!CJ16,\"\")","v":""},null,null,null,{"$f":"IF(CN$2=1,Klimadaten!CN16,\"\")","v":""},null,null,null,{"$f":"IF(CR$2=1,Klimadaten!CR16,\"\")","v":""},null,null,null,{"$f":"IF(CV$2=1,Klimadaten!CV16,\"\")","v":""},null,null,null,{"$f":"IF(CZ$2=1,Klimadaten!CZ16,\"\")","v":""},null,null,null,{"$f":"IF(DD$2=1,Klimadaten!DD16,\"\")","v":""},null,null,null,{"$f":"IF(DH$2=1,Klimadaten!DH16,\"\")","v":""},null,null,null,{"$f":"IF(DL$2=1,Klimadaten!DL16,\"\")","v":""},null,null,null,{"$f":"IF(DP$2=1,Klimadaten!DP16,\"\")","v":""},null,null,null,{"$f":"IF(DT$2=1,Klimadaten!DT16,\"\")","v":""},null,null,null,{"$f":"IF(DX$2=1,Klimadaten!DX16,\"\")","v":""},null,null,null,{"$f":"IF(EB$2=1,Klimadaten!EB16,\"\")","v":""},null,null,null,{"$f":"IF(EF$2=1,Klimadaten!EF16,\"\")","v":""},null,null,null,{"$f":"IF(EJ$2=1,Klimadaten!EJ16,\"\")","v":""},null,null,null,{"$f":"IF(EN$2=1,Klimadaten!EN16,\"\")","v":""},null,null,null,{"$f":"IF(ER$2=1,Klimadaten!ER16,\"\")","v":""},null,null,null,{"$f":"IF(EV$2=1,Klimadaten!EV16,\"\")","v":""},null,null,null,{"$f":"IF(EZ$2=1,Klimadaten!EZ16,\"\")","v":""},null,null,null,{"$f":"IF(FD$2=1,Klimadaten!FD16,\"\")","v":""},null,null,null,{"$f":"IF(FH$2=1,Klimadaten!FH16,\"\")","v":""},null,null,null,{"$f":"IF(FL$2=1,Klimadaten!FL16,\"\")","v":""},null,null,null,{"$f":"IF(FP$2=1,Klimadaten!FP16,\"\")","v":""},null,null,null,{"$f":"IF(FT$2=1,Klimadaten!FT16,\"\")","v":""},null,null,null,{"$f":"IF(FX$2=1,Klimadaten!FX16,\"\")","v":""},null,null,null,{"$f":"IF(GB$2=1,Klimadaten!GB16,\"\")","v":""},null,null,null,{"$f":"IF(GF$2=1,Klimadaten!GF16,\"\")","v":""},null,null,null,{"$f":"IF(GJ$2=1,Klimadaten!GJ16,\"\")","v":""},null,null,null,{"$f":"IF(GN$2=1,Klimadaten!GN16,\"\")","v":""},null,null,null,{"$f":"IF(GR$2=1,Klimadaten!GR16,\"\")","v":""},null,null,null,{"$f":"IF(GV$2=1,Klimadaten!GV16,\"\")","v":""},null,null,null,{"$f":"IF(GZ$2=1,Klimadaten!GZ16,\"\")","v":""},null,null,null,{"$f":"IF(HD$2=1,Klimadaten!HD16,\"\")","v":""},null,null,null,{"$f":"IF(HH$2=1,Klimadaten!HH16,\"\")","v":""},null,null,null,{"$f":"IF(HL$2=1,Klimadaten!HL16,\"\")","v":""},null,null,null,{"$f":"IF(HP$2=1,Klimadaten!HP16,\"\")","v":""},null,null,null,{"$f":"IF(HT$2=1,Klimadaten!HT16,\"\")","v":""},null,null,null,{"$f":"IF(HX$2=1,Klimadaten!HX16,\"\")","v":""},null,null,null,{"$f":"IF(IB$2=1,Klimadaten!IB16,\"\")","v":0},null,null,null,{"$f":"IF(IF$2=1,Klimadaten!IF16,\"\")","v":""},null,null,null,{"$f":"IF(IJ$2=1,Klimadaten!IJ16,\"\")","v":""},null,null,null,{"$f":"IF(IN$2=1,Klimadaten!IN16,\"\")","v":""},null,null,null,{"$f":"IF(IR$2=1,Klimadaten!IR16,\"\")","v":""},null,null,null,{"$f":"IF(IV$2=1,Klimadaten!IV16,\"\")","v":""},null,null,null,{"$f":"IF(IZ$2=1,Klimadaten!IZ16,\"\")","v":""},null,null,null,{"$f":"IF(JD$2=1,Klimadaten!JD16,\"\")","v":""},null,null,null,{"$f":"IF(JH$2=1,Klimadaten!JH16,\"\")","v":""},null,null,null,{"$f":"IF(JL$2=1,Klimadaten!JL16,\"\")","v":""}]
[-13,null,null,{"$f":"IF(D$2=1,Klimadaten!D17,\"\")","v":2},null,null,null,{"$f":"IF(H$2=1,Klimadaten!H17,\"\")","v":""},null,null,null,{"$f":"IF(L$2=1,Klimadaten!L17,\"\")","v":""},null,null,null,{"$f":"IF(P$2=1,Klimadaten!P17,\"\")","v":0},null,null,null,{"$f":"IF(T$2=1,Klimadaten!T17,\"\")","v":""},null,null,null,{"$f":"IF(X$2=1,Klimadaten!X17,\"\")","v":""},null,null,null,{"$f":"IF(AB$2=1,Klimadaten!AB17,\"\")","v":""},null,null,null,{"$f":"IF(AF$2=1,Klimadaten!AF17,\"\")","v":""},null,null,null,{"$f":"IF(AJ$2=1,Klimadaten!AJ17,\"\")","v":""},null,null,null,{"$f":"IF(AN$2=1,Klimadaten!AN17,\"\")","v":""},null,null,null,{"$f":"IF(AR$2=1,Klimadaten!AR17,\"\")","v":""},null,null,null,{"$f":"IF(AV$2=1,Klimadaten!AV17,\"\")","v":""},null,null,null,{"$f":"IF(AZ$2=1,Klimadaten!AZ17,\"\")","v":""},null,null,null,{"$f":"IF(BD$2=1,Klimadaten!BD17,\"\")","v":""},null,null,null,{"$f":"IF(BH$2=1,Klimadaten!BH17,\"\")","v":""},null,null,null,{"$f":"IF(BL$2=1,Klimadaten!BL17,\"\")","v":""},null,null,null,{"$f":"IF(BP$2=1,Klimadaten!BP17,\"\")","v":""},null,null,null,{"$f":"IF(BT$2=1,Klimadaten!BT17,\"\")","v":0},null,null,null,{"$f":"IF(BX$2=1,Klimadaten!BX17,\"\")","v":""},null,null,null,{"$f":"IF(CB$2=1,Klimadaten!CB17,\"\")","v":""},null,null,null,{"$f":"IF(CF$2=1,Klimadaten!CF17,\"\")","v":""},null,null,null,{"$f":"IF(CJ$2=1,Klimadaten!CJ17,\"\")","v":""},null,null,null,{"$f":"IF(CN$2=1,Klimadaten!CN17,\"\")","v":""},null,null,null,{"$f":"IF(CR$2=1,Klimadaten!CR17,\"\")","v":""},null,null,null,{"$f":"IF(CV$2=1,Klimadaten!CV17,\"\")","v":""},null,null,null,{"$f":"IF(CZ$2=1,Klimadaten!CZ17,\"\")","v":""},null,null,null,{"$f":"IF(DD$2=1,Klimadaten!DD17,\"\")","v":""},null,null,null,{"$f":"IF(DH$2=1,Klimadaten!DH17,\"\")","v":""},null,null,null,{"$f":"IF(DL$2=1,Klimadaten!DL17,\"\")","v":""},null,null,null,{"$f":"IF(DP$2=1,Klimadaten!DP17,\"\")","v":""},null,null,null,{"$f":"IF(DT$2=1,Klimadaten!DT17,\"\")","v":""},null,null,null,{"$f":"IF(DX$2=1,Klimadaten!DX17,\"\")","v":""},null,null,null,{"$f":"IF(EB$2=1,Klimadaten!EB17,\"\")","v":""},null,null,null,{"$f":"IF(EF$2=1,Klimadaten!EF17,\"\")","v":""},null,null,null,{"$f":"IF(EJ$2=1,Klimadaten!EJ17,\"\")","v":""},null,null,null,{"$f":"IF(EN$2=1,Klimadaten!EN17,\"\")","v":""},null,null,null,{"$f":"IF(ER$2=1,Klimadaten!ER17,\"\")","v":""},null,null,null,{"$f":"IF(EV$2=1,Klimadaten!EV17,\"\")","v":""},null,null,null,{"$f":"IF(EZ$2=1,Klimadaten!EZ17,\"\")","v":""},null,null,null,{"$f":"IF(FD$2=1,Klimadaten!FD17,\"\")","v":""},null,null,null,{"$f":"IF(FH$2=1,Klimadaten!FH17,\"\")","v":""},null,null,null,{"$f":"IF(FL$2=1,Klimadaten!FL17,\"\")","v":""},null,null,null,{"$f":"IF(FP$2=1,Klimadaten!FP17,\"\")","v":""},null,null,null,{"$f":"IF(FT$2=1,Klimadaten!FT17,\"\")","v":""},null,null,null,{"$f":"IF(FX$2=1,Klimadaten!FX17,\"\")","v":""},null,null,null,{"$f":"IF(GB$2=1,Klimadaten!GB17,\"\")","v":""},null,null,null,{"$f":"IF(GF$2=1,Klimadaten!GF17,\"\")","v":""},null,null,null,{"$f":"IF(GJ$2=1,Klimadaten!GJ17,\"\")","v":""},null,null,null,{"$f":"IF(GN$2=1,Klimadaten!GN17,\"\")","v":""},null,null,null,{"$f":"IF(GR$2=1,Klimadaten!GR17,\"\")","v":""},null,null,null,{"$f":"IF(GV$2=1,Klimadaten!GV17,\"\")","v":""},null,null,null,{"$f":"IF(GZ$2=1,Klimadaten!GZ17,\"\")","v":""},null,null,null,{"$f":"IF(HD$2=1,Klimadaten!HD17,\"\")","v":""},null,null,null,{"$f":"IF(HH$2=1,Klimadaten!HH17,\"\")","v":""},null,null,null,{"$f":"IF(HL$2=1,Klimadaten!HL17,\"\")","v":""},null,null,null,{"$f":"IF(HP$2=1,Klimadaten!HP17,\"\")","v":""},null,null,null,{"$f":"IF(HT$2=1,Klimadaten!HT17,\"\")","v":""},null,null,null,{"$f":"IF(HX$2=1,Klimadaten!HX17,\"\")","v":""},null,null,null,{"$f":"IF(IB$2=1,Klimadaten!IB17,\"\")","v":0},null,null,null,{"$f":"IF(IF$2=1,Klimadaten!IF17,\"\")","v":""},null,null,null,{"$f":"IF(IJ$2=1,Klimadaten!IJ17,\"\")","v":""},null,null,null,{"$f":"IF(IN$2=1,Klimadaten!IN17,\"\")","v":""},null,null,null,{"$f":"IF(IR$2=1,Klimadaten!IR17,\"\")","v":""},null,null,null,{"$f":"IF(IV$2=1,Klimadaten!IV17,\"\")","v":""},null,null,null,{"$f":"IF(IZ$2=1,Klimadaten!IZ17,\"\")","v":""},null,null,null,{"$f":"IF(JD$2=1,Klimadaten!JD17,\"\")","v":""},null,null,null,{"$f":"IF(JH$2=1,Klimadaten!JH17,\"\")","v":""},null,null,null,{"$f":"IF(JL$2=1,Klimadaten!JL17,\"\")","v":""}]
[-12,null,null,{"$f":"IF(D$2=1,Klimadaten!D18,\"\")","v":4},null,null,null,{"$f":"IF(H$2=1,Klimadaten!H18,\"\")","v":""},null,null,null,{"$f":"IF(L$2=1,Klimadaten!L18,\"\")","v":""},null,null,null,{"$f":"IF(P$2=1,Klimadaten!P18,\"\")","v":0},null,null,null,{"$f":"IF(T$2=1,Klimadaten!T18,\"\")","v":""},null,null,null,{"$f":"IF(X$2=1,Klimadaten!X18,\"\")","v":""},null,null,null,{"$f":"IF(AB$2=1,Klimadaten!AB18,\"\")","v":""},null,null,null,{"$f":"IF(AF$2=1,Klimadaten!AF18,\"\")","v":""},null,null,null,{"$f":"IF(AJ$2=1,Klimadaten!AJ18,\"\")","v":""},null,null,null,{"$f":"IF(AN$2=1,Klimadaten!AN18,\"\")","v":""},null,null,null,{"$f":"IF(AR$2=1,Klimadaten!AR18,\"\")","v":""},null,null,null,{"$f":"IF(AV$2=1,Klimadaten!AV18,\"\")","v":""},null,null,null,{"$f":"IF(AZ$2=1,Klimadaten!AZ18,\"\")","v":""},null,null,null,{"$f":"IF(BD$2=1,Klimadaten!BD18,\"\")","v":""},null,null,null,{"$f":"IF(BH$2=1,Klimadaten!BH18,\"\")","v":""},null,null,null,{"$f":"IF(BL$2=1,Klimadaten!BL18,\"\")","v":""},null,null,null,{"$f":"IF(BP$2=1,Klimadaten!BP18,\"\")","v":""},null,null,null,{"$f":"IF(BT$2=1,Klimadaten!BT18,\"\")","v":1},null,null,null,{"$f":"IF(BX$2=1,Klimadaten!BX18,\"\")","v":""},null,null,null,{"$f":"IF(CB$2=1,Klimadaten!CB18,\"\")","v":""},null,null,null,{"$f":"IF(CF$2=1,Klimadaten!CF18,\"\")","v":""},null,null,null,{"$f":"IF(CJ$2=1,Klimadaten!CJ18,\"\")","v":""},null,null,null,{"$f":"IF(CN$2=1,Klimadaten!CN18,\"\")","v":""},null,null,null,{"$f":"IF(CR$2=1,Klimadaten!CR18,\"\")","v":""},null,null,null,{"$f":"IF(CV$2=1,Klimadaten!CV18,\"\")","v":""},null,null,null,{"$f":"IF(CZ$2=1,Klimadaten!CZ18,\"\")","v":""},null,null,null,{"$f":"IF(DD$2=1,Klimadaten!DD18,\"\")","v":""},null,null,null,{"$f":"IF(DH$2=1,Klimadaten!DH18,\"\")","v":""},null,null,null,{"$f":"IF(DL$2=1,Klimadaten!DL18,\"\")","v":""},null,null,null,{"$f":"IF(DP$2=1,Klimadaten!DP18,\"\")","v":""},null,null,null,{"$f":"IF(DT$2=1,Klimadaten!DT18,\"\")","v":""},null,null,null,{"$f":"IF(DX$2=1,Klimadaten!DX18,\"\")","v":""},null,null,null,{"$f":"IF(EB$2=1,Klimadaten!EB18,\"\")","v":""},null,null,null,{"$f":"IF(EF$2=1,Klimadaten!EF18,\"\")","v":""},null,null,null,{"$f":"IF(EJ$2=1,Klimadaten!EJ18,\"\")","v":""},null,null,null,{"$f":"IF(EN$2=1,Klimadaten!EN18,\"\")","v":""},null,null,null,{"$f":"IF(ER$2=1,Klimadaten!ER18,\"\")","v":""},null,null,null,{"$f":"IF(EV$2=1,Klimadaten!EV18,\"\")","v":""},null,null,null,{"$f":"IF(EZ$2=1,Klimadaten!EZ18,\"\")","v":""},null,null,null,{"$f":"IF(FD$2=1,Klimadaten!FD18,\"\")","v":""},null,null,null,{"$f":"IF(FH$2=1,Klimadaten!FH18,\"\")","v":""},null,null,null,{"$f":"IF(FL$2=1,Klimadaten!FL18,\"\")","v":""},null,null,null,{"$f":"IF(FP$2=1,Klimadaten!FP18,\"\")","v":""},null,null,null,{"$f":"IF(FT$2=1,Klimadaten!FT18,\"\")","v":""},null,null,null,{"$f":"IF(FX$2=1,Klimadaten!FX18,\"\")","v":""},null,null,null,{"$f":"IF(GB$2=1,Klimadaten!GB18,\"\")","v":""},null,null,null,{"$f":"IF(GF$2=1,Klimadaten!GF18,\"\")","v":""},null,null,null,{"$f":"IF(GJ$2=1,Klimadaten!GJ18,\"\")","v":""},null,null,null,{"$f":"IF(GN$2=1,Klimadaten!GN18,\"\")","v":""},null,null,null,{"$f":"IF(GR$2=1,Klimadaten!GR18,\"\")","v":""},null,null,null,{"$f":"IF(GV$2=1,Klimadaten!GV18,\"\")","v":""},null,null,null,{"$f":"IF(GZ$2=1,Klimadaten!GZ18,\"\")","v":""},null,null,null,{"$f":"IF(HD$2=1,Klimadaten!HD18,\"\")","v":""},null,null,null,{"$f":"IF(HH$2=1,Klimadaten!HH18,\"\")","v":""},null,null,null,{"$f":"IF(HL$2=1,Klimadaten!HL18,\"\")","v":""},null,null,null,{"$f":"IF(HP$2=1,Klimadaten!HP18,\"\")","v":""},null,null,null,{"$f":"IF(HT$2=1,Klimadaten!HT18,\"\")","v":""},null,null,null,{"$f":"IF(HX$2=1,Klimadaten!HX18,\"\")","v":""},null,null,null,{"$f":"IF(IB$2=1,Klimadaten!IB18,\"\")","v":0},null,null,null,{"$f":"IF(IF$2=1,Klimadaten!IF18,\"\")","v":""},null,null,null,{"$f":"IF(IJ$2=1,Klimadaten!IJ18,\"\")","v":""},null,null,null,{"$f":"IF(IN$2=1,Klimadaten!IN18,\"\")","v":""},null,null,null,{"$f":"IF(IR$2=1,Klimadaten!IR18,\"\")","v":""},null,null,null,{"$f":"IF(IV$2=1,Klimadaten!IV18,\"\")","v":""},null,null,null,{"$f":"IF(IZ$2=1,Klimadaten!IZ18,\"\")","v":""},null,null,null,{"$f":"IF(JD$2=1,Klimadaten!JD18,\"\")","v":""},null,null,null,{"$f":"IF(JH$2=1,Klimadaten!JH18,\"\")","v":""},null,null,null,{"$f":"IF(JL$2=1,Klimadaten!JL18,\"\")","v":""}]
[-11,null,null,{"$f":"IF(D$2=1,Klimadaten!D19,\"\")","v":2},null,null,null,{"$f":"IF(H$2=1,Klimadaten!H19,\"\")","v":""},null,null,null,{"$f":"IF(L$2=1,Klimadaten!L19,\"\")","v":""},null,null,null,{"$f":"IF(P$2=1,Klimadaten!P19,\"\")","v":0},null,null,null,{"$f":"IF(T$2=1,Klimadaten!T19,\"\")","v":""},null,null,null,{"$f":"IF(X$2=1,Klimadaten!X19,\"\")","v":""},null,null,null,{"$f":"IF(AB$2=1,Klimadaten!AB19,\"\")","v":""},null,null,null,{"$f":"IF(AF$2=1,Klimadaten!AF19,\"\")","v":""},null,null,null,{"$f":"IF(AJ$2=1,Klimadaten!AJ19,\"\")","v":""},null,null,null,{"$f":"IF(AN$2=1,Klimadaten!AN19,\"\")","v":""},null,null,null,{"$f":"IF(AR$2=1,Klimadaten!AR19,\"\")","v":""},null,null,null,{"$f":"IF(AV$2=1,Klimadaten!AV19,\"\")","v":""},null,null,null,{"$f":"IF(AZ$2=1,Klimadaten!AZ19,\"\")","v":""},null,null,null,{"$f":"IF(BD$2=1,Klimadaten!BD19,\"\")","v":""},null,null,null,{"$f":"IF(BH$2=1,Klimadaten!BH19,\"\")","v":""},null,null,null,{"$f":"IF(BL$2=1,Klimadaten!BL19,\"\")","v":""},null,null,null,{"$f":"IF(BP$2=1,Klimadaten!BP19,\"\")","v":""},null,null,null,{"$f":"IF(BT$2=1,Klimadaten!BT19,\"\")","v":1},null,null,null,{"$f":"IF(BX$2=1,Klimadaten!BX19,\"\")","v":""},null,null,null,{"$f":"IF(CB$2=1,Klimadaten!CB19,\"\")","v":""},null,null,null,{"$f":"IF(CF$2=1,Klimadaten!CF19,\"\")","v":""},null,null,null,{"$f":"IF(CJ$2=1,Klimadaten!CJ19,\"\")","v":""},null,null,null,{"$f":"IF(CN$2=1,Klimadaten!CN19,\"\")","v":""},null,null,null,{"$f":"IF(CR$2=1,Klimadaten!CR19,\"\")","v":""},null,null,null,{"$f":"IF(CV$2=1,Klimadaten!CV19,\"\")","v":""},null,null,null,{"$f":"IF(CZ$2=1,Klimadaten!CZ19,\"\")","v":""},null,null,null,{"$f":"IF(DD$2=1,Klimadaten!DD19,\"\")","v":""},null,null,null,{"$f":"IF(DH$2=1,Klimadaten!DH19,\"\")","v":""},null,null,null,{"$f":"IF(DL$2=1,Klimadaten!DL19,\"\")","v":""},null,null,null,{"$f":"IF(DP$2=1,Klimadaten!DP19,\"\")","v":""},null,null,null,{"$f":"IF(DT$2=1,Klimadaten!DT19,\"\")","v":""},null,null,null,{"$f":"IF(DX$2=1,Klimadaten!DX19,\"\")","v":""},null,null,null,{"$f":"IF(EB$2=1,Klimadaten!EB19,\"\")","v":""},null,null,null,{"$f":"IF(EF$2=1,Klimadaten!EF19,\"\")","v":""},null,null,null,{"$f":"IF(EJ$2=1,Klimadaten!EJ19,\"\")","v":""},null,null,null,{"$f":"IF(EN$2=1,Klimadaten!EN19,\"\")","v":""},null,null,null,{"$f":"IF(ER$2=1,Klimadaten!ER19,\"\")","v":""},null,null,null,{"$f":"IF(EV$2=1,Klimadaten!EV19,\"\")","v":""},null,null,null,{"$f":"IF(EZ$2=1,Klimadaten!EZ19,\"\")","v":""},null,null,null,{"$f":"IF(FD$2=1,Klimadaten!FD19,\"\")","v":""},null,null,null,{"$f":"IF(FH$2=1,Klimadaten!FH19,\"\")","v":""},null,null,null,{"$f":"IF(FL$2=1,Klimadaten!FL19,\"\")","v":""},null,null,null,{"$f":"IF(FP$2=1,Klimadaten!FP19,\"\")","v":""},null,null,null,{"$f":"IF(FT$2=1,Klimadaten!FT19,\"\")","v":""},null,null,null,{"$f":"IF(FX$2=1,Klimadaten!FX19,\"\")","v":""},null,null,null,{"$f":"IF(GB$2=1,Klimadaten!GB19,\"\")","v":""},null,null,null,{"$f":"IF(GF$2=1,Klimadaten!GF19,\"\")","v":""},null,null,null,{"$f":"IF(GJ$2=1,Klimadaten!GJ19,\"\")","v":""},null,null,null,{"$f":"IF(GN$2=1,Klimadaten!GN19,\"\")","v":""},null,null,null,{"$f":"IF(GR$2=1,Klimadaten!GR19,\"\")","v":""},null,null,null,{"$f":"IF(GV$2=1,Klimadaten!GV19,\"\")","v":""},null,null,null,{"$f":"IF(GZ$2=1,Klimadaten!GZ19,\"\")","v":""},null,null,null,{"$f":"IF(HD$2=1,Klimadaten!HD19,\"\")","v":""},null,null,null,{"$f":"IF(HH$2=1,Klimadaten!HH19,\"\")","v":""},null,null,null,{"$f":"IF(HL$2=1,Klimadaten!HL19,\"\")","v":""},null,null,null,{"$f":"IF(HP$2=1,Klimadaten!HP19,\"\")","v":""},null,null,null,{"$f":"IF(HT$2=1,Klimadaten!HT19,\"\")","v":""},null,null,null,{"$f":"IF(HX$2=1,Klimadaten!HX19,\"\")","v":""},null,null,null,{"$f":"IF(IB$2=1,Klimadaten!IB19,\"\")","v":0},null,null,null,{"$f":"IF(IF$2=1,Klimadaten!IF19,\"\")","v":""},null,null,null,{"$f":"IF(IJ$2=1,Klimadaten!IJ19,\"\")","v":""},null,null,null,{"$f":"IF(IN$2=1,Klimadaten!IN19,\"\")","v":""},null,null,null,{"$f":"IF(IR$2=1,Klimadaten!IR19,\"\")","v":""},null,null,null,{"$f":"IF(IV$2=1,Klimadaten!IV19,\"\")","v":""},null,null,null,{"$f":"IF(IZ$2=1,Klimadaten!IZ19,\"\")","v":""},null,null,null,{"$f":"IF(JD$2=1,Klimadaten!JD19,\"\")","v":""},null,null,null,{"$f":"IF(JH$2=1,Klimadaten!JH19,\"\")","v":""},null,null,null,{"$f":"IF(JL$2=1,Klimadaten!JL19,\"\")","v":""}]
[-10,null,null,{"$f":"IF(D$2=1,Klimadaten!D20,\"\")","v":5},null,null,null,{"$f":"IF(H$2=1,Klimadaten!H20,\"\")","v":""},null,null,null,{"$f":"IF(L$2=1,Klimadaten!L20,\"\")","v":""},null,null,null,{"$f":"IF(P$2=1,Klimadaten!P20,\"\")","v":0},null,null,null,{"$f":"IF(T$2=1,Klimadaten!T20,\"\")","v":""},null,null,null,{"$f":"IF(X$2=1,Klimadaten!X20,\"\")","v":""},null,null,null,{"$f":"IF(AB$2=1,Klimadaten!AB20,\"\")","v":""},null,null,null,{"$f":"IF(AF$2=1,Klimadaten!AF20,\"\")","v":""},null,null,null,{"$f":"IF(AJ$2=1,Klimadaten!AJ20,\"\")","v":""},null,null,null,{"$f":"IF(AN$2=1,Klimadaten!AN20,\"\")","v":""},null,null,null,{"$f":"IF(AR$2=1,Klimadaten!AR20,\"\")","v":""},null,null,null,{"$f":"IF(AV$2=1,Klimadaten!AV20,\"\")","v":""},null,null,null,{"$f":"IF(AZ$2=1,Klimadaten!AZ20,\"\")","v":""},null,null,null,{"$f":"IF(BD$2=1,Klimadaten!BD20,\"\")","v":""},null,null,null,{"$f":"IF(BH$2=1,Klimadaten!BH20,\"\")","v":""},null,null,null,{"$f":"IF(BL$2=1,Klimadaten!BL20,\"\")","v":""},null,null,null,{"$f":"IF(BP$2=1,Klimadaten!BP20,\"\")","v":""},null,null,null,{"$f":"IF(BT$2=1,Klimadaten!BT20,\"\")","v":1},null,null,null,{"$f":"IF(BX$2=1,Klimadaten!BX20,\"\")","v":""},null,null,null,{"$f":"IF(CB$2=1,Klimadaten!CB20,\"\")","v":""},null,null,null,{"$f":"IF(CF$2=1,Klimadaten!CF20,\"\")","v":""},null,null,null,{"$f":"IF(CJ$2=1,Klimadaten!CJ20,\"\")","v":""},null,null,null,{"$f":"IF(CN$2=1,Klimadaten!CN20,\"\")","v":""},null,null,null,{"$f":"IF(CR$2=1,Klimadaten!CR20,\"\")","v":""},null,null,null,{"$f":"IF(CV$2=1,Klimadaten!CV20,\"\")","v":""},null,null,null,{"$f":"IF(CZ$2=1,Klimadaten!CZ20,\"\")","v":""},null,null,null,{"$f":"IF(DD$2=1,Klimadaten!DD20,\"\")","v":""},null,null,null,{"$f":"IF(DH$2=1,Klimadaten!DH20,\"\")","v":""},null,null,null,{"$f":"IF(DL$2=1,Klimadaten!DL20,\"\")","v":""},null,null,null,{"$f":"IF(DP$2=1,Klimadaten!DP20,\"\")","v":""},null,null,null,{"$f":"IF(DT$2=1,Klimadaten!DT20,\"\")","v":""},null,null,null,{"$f":"IF(DX$2=1,Klimadaten!DX20,\"\")","v":""},null,null,null,{"$f":"IF(EB$2=1,Klimadaten!EB20,\"\")","v":""},null,null,null,{"$f":"IF(EF$2=1,Klimadaten!EF20,\"\")","v":""},null,null,null,{"$f":"IF(EJ$2=1,Klimadaten!EJ20,\"\")","v":""},null,null,null,{"$f":"IF(EN$2=1,Klimadaten!EN20,\"\")","v":""},null,null,null,{"$f":"IF(ER$2=1,Klimadaten!ER20,\"\")","v":""},null,null,null,{"$f":"IF(EV$2=1,Klimadaten!EV20,\"\")","v":""},null,null,null,{"$f":"IF(EZ$2=1,Klimadaten!EZ20,\"\")","v":""},null,null,null,{"$f":"IF(FD$2=1,Klimadaten!FD20,\"\")","v":""},null,null,null,{"$f":"IF(FH$2=1,Klimadaten!FH20,\"\")","v":""},null,null,null,{"$f":"IF(FL$2=1,Klimadaten!FL20,\"\")","v":""},null,null,null,{"$f":"IF(FP$2=1,Klimadaten!FP20,\"\")","v":""},null,null,null,{"$f":"IF(FT$2=1,Klimadaten!FT20,\"\")","v":""},null,null,null,{"$f":"IF(FX$2=1,Klimadaten!FX20,\"\")","v":""},null,null,null,{"$f":"IF(GB$2=1,Klimadaten!GB20,\"\")","v":""},null,null,null,{"$f":"IF(GF$2=1,Klimadaten!GF20,\"\")","v":""},null,null,null,{"$f":"IF(GJ$2=1,Klimadaten!GJ20,\"\")","v":""},null,null,null,{"$f":"IF(GN$2=1,Klimadaten!GN20,\"\")","v":""},null,null,null,{"$f":"IF(GR$2=1,Klimadaten!GR20,\"\")","v":""},null,null,null,{"$f":"IF(GV$2=1,Klimadaten!GV20,\"\")","v":""},null,null,null,{"$f":"IF(GZ$2=1,Klimadaten!GZ20,\"\")","v":""},null,null,null,{"$f":"IF(HD$2=1,Klimadaten!HD20,\"\")","v":""},null,null,null,{"$f":"IF(HH$2=1,Klimadaten!HH20,\"\")","v":""},null,null,null,{"$f":"IF(HL$2=1,Klimadaten!HL20,\"\")","v":""},null,null,null,{"$f":"IF(HP$2=1,Klimadaten!HP20,\"\")","v":""},null,null,null,{"$f":"IF(HT$2=1,Klimadaten!HT20,\"\")","v":""},null,null,null,{"$f":"IF(HX$2=1,Klimadaten!HX20,\"\")","v":""},null,null,null,{"$f":"IF(IB$2=1,Klimadaten!IB20,\"\")","v":0},null,null,null,{"$f":"IF(IF$2=1,Klimadaten!IF20,\"\")","v":""},null,null,null,{"$f":"IF(IJ$2=1,Klimadaten!IJ20,\"\")","v":""},null,null,null,{"$f":"IF(IN$2=1,Klimadaten!IN20,\"\")","v":""},null,null,null,{"$f":"IF(IR$2=1,Klimadaten!IR20,\"\")","v":""},null,null,null,{"$f":"IF(IV$2=1,Klimadaten!IV20,\"\")","v":""},null,null,null,{"$f":"IF(IZ$2=1,Klimadaten!IZ20,\"\")","v":""},null,null,null,{"$f":"IF(JD$2=1,Klimadaten!JD20,\"\")","v":""},null,null,null,{"$f":"IF(JH$2=1,Klimadaten!JH20,\"\")","v":""},null,null,null,{"$f":"IF(JL$2=1,Klimadaten!JL20,\"\")","v":""}]
[-9,null,null,{"$f":"IF(D$2=1,Klimadaten!D21,\"\")","v":6},null,null,null,{"$f":"IF(H$2=1,Klimadaten!H21,\"\")","v":""},null,null,null,{"$f":"IF(L$2=1,Klimadaten!L21,\"\")","v":""},null,null,null,{"$f":"IF(P$2=1,Klimadaten!P21,\"\")","v":1},null,null,null,{"$f":"IF(T$2=1,Klimadaten!T21,\"\")","v":""},null,null,null,{"$f":"IF(X$2=1,Klimadaten!X21,\"\")","v":""},null,null,null,{"$f":"IF(AB$2=1,Klimadaten!AB21,\"\")","v":""},null,null,null,{"$f":"IF(AF$2=1,Klimadaten!AF21,\"\")","v":""},null,null,null,{"$f":"IF(AJ$2=1,Klimadaten!AJ21,\"\")","v":""},null,null,null,{"$f":"IF(AN$2=1,Klimadaten!AN21,\"\")","v":""},null,null,null,{"$f":"IF(AR$2=1,Klimadaten!AR21,\"\")","v":""},null,null,null,{"$f":"IF(AV$2=1,Klimadaten!AV21,\"\")","v":""},null,null,null,{"$f":"IF(AZ$2=1,Klimadaten!AZ21,\"\")","v":""},null,null,null,{"$f":"IF(BD$2=1,Klimadaten!BD21,\"\")","v":""},null,null,null,{"$f":"IF(BH$2=1,Klimadaten!BH21,\"\")","v":""},null,null,null,{"$f":"IF(BL$2=1,Klimadaten!BL21,\"\")","v":""},null,null,null,{"$f":"IF(BP$2=1,Klimadaten!BP21,\"\")","v":""},null,null,null,{"$f":"IF(BT$2=1,Klimadaten!BT21,\"\")","v":2},null,null,null,{"$f":"IF(BX$2=1,Klimadaten!BX21,\"\")","v":""},null,null,null,{"$f":"IF(CB$2=1,Klimadaten!CB21,\"\")","v":""},null,null,null,{"$f":"IF(CF$2=1,Klimadaten!CF21,\"\")","v":""},null,null,null,{"$f":"IF(CJ$2=1,Klimadaten!CJ21,\"\")","v":""},null,null,null,{"$f":"IF(CN$2=1,Klimadaten!CN21,\"\")","v":""},null,null,null,{"$f":"IF(CR$2=1,Klimadaten!CR21,\"\")","v":""},null,null,null,{"$f":"IF(CV$2=1,Klimadaten!CV21,\"\")","v":""},null,null,null,{"$f":"IF(CZ$2=1,Klimadaten!CZ21,\"\")","v":""},null,null,null,{"$f":"IF(DD$2=1,Klimadaten!DD21,\"\")","v":""},null,null,null,{"$f":"IF(DH$2=1,Klimadaten!DH21,\"\")","v":""},null,null,null,{"$f":"IF(DL$2=1,Klimadaten!DL21,\"\")","v":""},null,null,null,{"$f":"IF(DP$2=1,Klimadaten!DP21,\"\")","v":""},null,null,null,{"$f":"IF(DT$2=1,Klimadaten!DT21,\"\")","v":""},null,null,null,{"$f":"IF(DX$2=1,Klimadaten!DX21,\"\")","v":""},null,null,null,{"$f":"IF(EB$2=1,Klimadaten!EB21,\"\")","v":""},null,null,null,{"$f":"IF(EF$2=1,Klimadaten!EF21,\"\")","v":""},null,null,null,{"$f":"IF(EJ$2=1,Klimadaten!EJ21,\"\")","v":""},null,null,null,{"$f":"IF(EN$2=1,Klimadaten!EN21,\"\")","v":""},null,null,null,{"$f":"IF(ER$2=1,Klimadaten!ER21,\"\")","v":""},null,null,null,{"$f":"IF(EV$2=1,Klimadaten!EV21,\"\")","v":""},null,null,null,{"$f":"IF(EZ$2=1,Klimadaten!EZ21,\"\")","v":""},null,null,null,{"$f":"IF(FD$2=1,Klimadaten!FD21,\"\")","v":""},null,null,null,{"$f":"IF(FH$2=1,Klimadaten!FH21,\"\")","v":""},null,null,null,{"$f":"IF(FL$2=1,Klimadaten!FL21,\"\")","v":""},null,null,null,{"$f":"IF(FP$2=1,Klimadaten!FP21,\"\")","v":""},null,null,null,{"$f":"IF(FT$2=1,Klimadaten!FT21,\"\")","v":""},null,null,null,{"$f":"IF(FX$2=1,Klimadaten!FX21,\"\")","v":""},null,null,null,{"$f":"IF(GB$2=1,Klimadaten!GB21,\"\")","v":""},null,null,null,{"$f":"IF(GF$2=1,Klimadaten!GF21,\"\")","v":""},null,null,null,{"$f":"IF(GJ$2=1,Klimadaten!GJ21,\"\")","v":""},null,null,null,{"$f":"IF(GN$2=1,Klimadaten!GN21,\"\")","v":""},null,null,null,{"$f":"IF(GR$2=1,Klimadaten!GR21,\"\")","v":""},null,null,null,{"$f":"IF(GV$2=1,Klimadaten!GV21,\"\")","v":""},null,null,null,{"$f":"IF(GZ$2=1,Klimadaten!GZ21,\"\")","v":""},null,null,null,{"$f":"IF(HD$2=1,Klimadaten!HD21,\"\")","v":""},null,null,null,{"$f":"IF(HH$2=1,Klimadaten!HH21,\"\")","v":""},null,null,null,{"$f":"IF(HL$2=1,Klimadaten!HL21,\"\")","v":""},null,null,null,{"$f":"IF(HP$2=1,Klimadaten!HP21,\"\")","v":""},null,null,null,{"$f":"IF(HT$2=1,Klimadaten!HT21,\"\")","v":""},null,null,null,{"$f":"IF(HX$2=1,Klimadaten!HX21,\"\")","v":""},null,null,null,{"$f":"IF(IB$2=1,Klimadaten!IB21,\"\")","v":0},null,null,null,{"$f":"IF(IF$2=1,Klimadaten!IF21,\"\")","v":""},null,null,null,{"$f":"IF(IJ$2=1,Klimadaten!IJ21,\"\")","v":""},null,null,null,{"$f":"IF(IN$2=1,Klimadaten!IN21,\"\")","v":""},null,null,null,{"$f":"IF(IR$2=1,Klimadaten!IR21,\"\")","v":""},null,null,null,{"$f":"IF(IV$2=1,Klimadaten!IV21,\"\")","v":""},null,null,null,{"$f":"IF(IZ$2=1,Klimadaten!IZ21,\"\")","v":""},null,null,null,{"$f":"IF(JD$2=1,Klimadaten!JD21,\"\")","v":""},null,null,null,{"$f":"IF(JH$2=1,Klimadaten!JH21,\"\")","v":""},null,null,null,{"$f":"IF(JL$2=1,Klimadaten!JL21,\"\")","v":""}]
[-8,null,null,{"$f":"IF(D$2=1,Klimadaten!D22,\"\")","v":7},null,null,null,{"$f":"IF(H$2=1,Klimadaten!H22,\"\")","v":""},null,null,null,{"$f":"IF(L$2=1,Klimadaten!L22,\"\")","v":""},null,null,null,{"$f":"IF(P$2=1,Klimadaten!P22,\"\")","v":1},null,null,null,{"$f":"IF(T$2=1,Klimadaten!T22,\"\")","v":""},null,null,null,{"$f":"IF(X$2=1,Klimadaten!X22,\"\")","v":""},null,null,null,{"$f":"IF(AB$2=1,Klimadaten!AB22,\"\")","v":""},null,null,null,{"$f":"IF(AF$2=1,Klimadaten!AF22,\"\")","v":""},null,null,null,{"$f":"IF(AJ$2=1,Klimadaten!AJ22,\"\")","v":""},null,null,null,{"$f":"IF(AN$2=1,Klimadaten!AN22,\"\")","v":""},null,null,null,{"$f":"IF(AR$2=1,Klimadaten!AR22,\"\")","v":""},null,null,null,{"$f":"IF(AV$2=1,Klimadaten!AV22,\"\")","v":""},null,null,null,{"$f":"IF(AZ$2=1,Klimadaten!AZ22,\"\")","v":""},null,null,null,{"$f":"IF(BD$2=1,Klimadaten!BD22,\"\")","v":""},null,null,null,{"$f":"IF(BH$2=1,Klimadaten!BH22,\"\")","v":""},null,null,null,{"$f":"IF(BL$2=1,Klimadaten!BL22,\"\")","v":""},null,null,null,{"$f":"IF(BP$2=1,Klimadaten!BP22,\"\")","v":""},null,null,null,{"$f":"IF(BT$2=1,Klimadaten!BT22,\"\")","v":3},null,null,null,{"$f":"IF(BX$2=1,Klimadaten!BX22,\"\")","v":""},null,null,null,{"$f":"IF(CB$2=1,Klimadaten!CB22,\"\")","v":""},null,null,null,{"$f":"IF(CF$2=1,Klimadaten!CF22,\"\")","v":""},null,null,null,{"$f":"IF(CJ$2=1,Klimadaten!CJ22,\"\")","v":""},null,null,null,{"$f":"IF(CN$2=1,Klimadaten!CN22,\"\")","v":""},null,null,null,{"$f":"IF(CR$2=1,Klimadaten!CR22,\"\")","v":""},null,null,null,{"$f":"IF(CV$2=1,Klimadaten!CV22,\"\")","v":""},null,null,null,{"$f":"IF(CZ$2=1,Klimadaten!CZ22,\"\")","v":""},null,null,null,{"$f":"IF(DD$2=1,Klimadaten!DD22,\"\")","v":""},null,null,null,{"$f":"IF(DH$2=1,Klimadaten!DH22,\"\")","v":""},null,null,null,{"$f":"IF(DL$2=1,Klimadaten!DL22,\"\")","v":""},null,null,null,{"$f":"IF(DP$2=1,Klimadaten!DP22,\"\")","v":""},null,null,null,{"$f":"IF(DT$2=1,Klimadaten!DT22,\"\")","v":""},null,null,null,{"$f":"IF(DX$2=1,Klimadaten!DX22,\"\")","v":""},null,null,null,{"$f":"IF(EB$2=1,Klimadaten!EB22,\"\")","v":""},null,null,null,{"$f":"IF(EF$2=1,Klimadaten!EF22,\"\")","v":""},null,null,null,{"$f":"IF(EJ$2=1,Klimadaten!EJ22,\"\")","v":""},null,null,null,{"$f":"IF(EN$2=1,Klimadaten!EN22,\"\")","v":""},null,null,null,{"$f":"IF(ER$2=1,Klimadaten!ER22,\"\")","v":""},null,null,null,{"$f":"IF(EV$2=1,Klimadaten!EV22,\"\")","v":""},null,null,null,{"$f":"IF(EZ$2=1,Klimadaten!EZ22,\"\")","v":""},null,null,null,{"$f":"IF(FD$2=1,Klimadaten!FD22,\"\")","v":""},null,null,null,{"$f":"IF(FH$2=1,Klimadaten!FH22,\"\")","v":""},null,null,null,{"$f":"IF(FL$2=1,Klimadaten!FL22,\"\")","v":""},null,null,null,{"$f":"IF(FP$2=1,Klimadaten!FP22,\"\")","v":""},null,null,null,{"$f":"IF(FT$2=1,Klimadaten!FT22,\"\")","v":""},null,null,null,{"$f":"IF(FX$2=1,Klimadaten!FX22,\"\")","v":""},null,null,null,{"$f":"IF(GB$2=1,Klimadaten!GB22,\"\")","v":""},null,null,null,{"$f":"IF(GF$2=1,Klimadaten!GF22,\"\")","v":""},null,null,null,{"$f":"IF(GJ$2=1,Klimadaten!GJ22,\"\")","v":""},null,null,null,{"$f":"IF(GN$2=1,Klimadaten!GN22,\"\")","v":""},null,null,null,{"$f":"IF(GR$2=1,Klimadaten!GR22,\"\")","v":""},null,null,null,{"$f":"IF(GV$2=1,Klimadaten!GV22,\"\")","v":""},null,null,null,{"$f":"IF(GZ$2=1,Klimadaten!GZ22,\"\")","v":""},null,null,null,{"$f":"IF(HD$2=1,Klimadaten!HD22,\"\")","v":""},null,null,null,{"$f":"IF(HH$2=1,Klimadaten!HH22,\"\")","v":""},null,null,null,{"$f":"IF(HL$2=1,Klimadaten!HL22,\"\")","v":""},null,null,null,{"$f":"IF(HP$2=1,Klimadaten!HP22,\"\")","v":""},null,null,null,{"$f":"IF(HT$2=1,Klimadaten!HT22,\"\")","v":""},null,null,null,{"$f":"IF(HX$2=1,Klimadaten!HX22,\"\")","v":""},null,null,null,{"$f":"IF(IB$2=1,Klimadaten!IB22,\"\")","v":0},null,null,null,{"$f":"IF(IF$2=1,Klimadaten!IF22,\"\")","v":""},null,null,null,{"$f":"IF(IJ$2=1,Klimadaten!IJ22,\"\")","v":""},null,null,null,{"$f":"IF(IN$2=1,Klimadaten!IN22,\"\")","v":""},null,null,null,{"$f":"IF(IR$2=1,Klimadaten!IR22,\"\")","v":""},null,null,null,{"$f":"IF(IV$2=1,Klimadaten!IV22,\"\")","v":""},null,null,null,{"$f":"IF(IZ$2=1,Klimadaten!IZ22,\"\")","v":""},null,null,null,{"$f":"IF(JD$2=1,Klimadaten!JD22,\"\")","v":""},null,null,null,{"$f":"IF(JH$2=1,Klimadaten!JH22,\"\")","v":""},null,null,null,{"$f":"IF(JL$2=1,Klimadaten!JL22,\"\")","v":""}]
[-7,null,null,{"$f":"IF(D$2=1,Klimadaten!D23,\"\")","v":7},null,null,null,{"$f":"IF(H$2=1,Klimadaten!H23,\"\")","v":""},null,null,null,{"$f":"IF(L$2=1,Klimadaten!L23,\"\")","v":""},null,null,null,{"$f":"IF(P$2=1,Klimadaten!P23,\"\")","v":2},null,null,null,{"$f":"IF(T$2=1,Klimadaten!T23,\"\")","v":""},null,null,null,{"$f":"IF(X$2=1,Klimadaten!X23,\"\")","v":""},null,null,null,{"$f":"IF(AB$2=1,Klimadaten!AB23,\"\")","v":""},null,null,null,{"$f":"IF(AF$2=1,Klimadaten!AF23,\"\")","v":""},null,null,null,{"$f":"IF(AJ$2=1,Klimadaten!AJ23,\"\")","v":""},null,null,null,{"$f":"IF(AN$2=1,Klimadaten!AN23,\"\")","v":""},null,null,null,{"$f":"IF(AR$2=1,Klimadaten!AR23,\"\")","v":""},null,null,null,{"$f":"IF(AV$2=1,Klimadaten!AV23,\"\")","v":""},null,null,null,{"$f":"IF(AZ$2=1,Klimadaten!AZ23,\"\")","v":""},null,null,null,{"$f":"IF(BD$2=1,Klimadaten!BD23,\"\")","v":""},null,null,null,{"$f":"IF(BH$2=1,Klimadaten!BH23,\"\")","v":""},null,null,null,{"$f":"IF(BL$2=1,Klimadaten!BL23,\"\")","v":""},null,null,null,{"$f":"IF(BP$2=1,Klimadaten!BP23,\"\")","v":""},null,null,null,{"$f":"IF(BT$2=1,Klimadaten!BT23,\"\")","v":3},null,null,null,{"$f":"IF(BX$2=1,Klimadaten!BX23,\"\")","v":""},null,null,null,{"$f":"IF(CB$2=1,Klimadaten!CB23,\"\")","v":""},null,null,null,{"$f":"IF(CF$2=1,Klimadaten!CF23,\"\")","v":""},null,null,null,{"$f":"IF(CJ$2=1,Klimadaten!CJ23,\"\")","v":""},null,null,null,{"$f":"IF(CN$2=1,Klimadaten!CN23,\"\")","v":""},null,null,null,{"$f":"IF(CR$2=1,Klimadaten!CR23,\"\")","v":""},null,null,null,{"$f":"IF(CV$2=1,Klimadaten!CV23,\"\")","v":""},null,null,null,{"$f":"IF(CZ$2=1,Klimadaten!CZ23,\"\")","v":""},null,null,null,{"$f":"IF(DD$2=1,Klimadaten!DD23,\"\")","v":""},null,null,null,{"$f":"IF(DH$2=1,Klimadaten!DH23,\"\")","v":""},null,null,null,{"$f":"IF(DL$2=1,Klimadaten!DL23,\"\")","v":""},null,null,null,{"$f":"IF(DP$2=1,Klimadaten!DP23,\"\")","v":""},null,null,null,{"$f":"IF(DT$2=1,Klimadaten!DT23,\"\")","v":""},null,null,null,{"$f":"IF(DX$2=1,Klimadaten!DX23,\"\")","v":""},null,null,null,{"$f":"IF(EB$2=1,Klimadaten!EB23,\"\")","v":""},null,null,null,{"$f":"IF(EF$2=1,Klimadaten!EF23,\"\")","v":""},null,null,null,{"$f":"IF(EJ$2=1,Klimadaten!EJ23,\"\")","v":""},null,null,null,{"$f":"IF(EN$2=1,Klimadaten!EN23,\"\")","v":""},null,null,null,{"$f":"IF(ER$2=1,Klimadaten!ER23,\"\")","v":""},null,null,null,{"$f":"IF(EV$2=1,Klimadaten!EV23,\"\")","v":""},null,null,null,{"$f":"IF(EZ$2=1,Klimadaten!EZ23,\"\")","v":""},null,null,null,{"$f":"IF(FD$2=1,Klimadaten!FD23,\"\")","v":""},null,null,null,{"$f":"IF(FH$2=1,Klimadaten!FH23,\"\")","v":""},null,null,null,{"$f":"IF(FL$2=1,Klimadaten!FL23,\"\")","v":""},null,null,null,{"$f":"IF(FP$2=1,Klimadaten!FP23,\"\")","v":""},null,null,null,{"$f":"IF(FT$2=1,Klimadaten!FT23,\"\")","v":""},null,null,null,{"$f":"IF(FX$2=1,Klimadaten!FX23,\"\")","v":""},null,null,null,{"$f":"IF(GB$2=1,Klimadaten!GB23,\"\")","v":""},null,null,null,{"$f":"IF(GF$2=1,Klimadaten!GF23,\"\")","v":""},null,null,null,{"$f":"IF(GJ$2=1,Klimadaten!GJ23,\"\")","v":""},null,null,null,{"$f":"IF(GN$2=1,Klimadaten!GN23,\"\")","v":""},null,null,null,{"$f":"IF(GR$2=1,Klimadaten!GR23,\"\")","v":""},null,null,null,{"$f":"IF(GV$2=1,Klimadaten!GV23,\"\")","v":""},null,null,null,{"$f":"IF(GZ$2=1,Klimadaten!GZ23,\"\")","v":""},null,null,null,{"$f":"IF(HD$2=1,Klimadaten!HD23,\"\")","v":""},null,null,null,{"$f":"IF(HH$2=1,Klimadaten!HH23,\"\")","v":""},null,null,null,{"$f":"IF(HL$2=1,Klimadaten!HL23,\"\")","v":""},null,null,null,{"$f":"IF(HP$2=1,Klimadaten!HP23,\"\")","v":""},null,null,null,{"$f":"IF(HT$2=1,Klimadaten!HT23,\"\")","v":""},null,null,null,{"$f":"IF(HX$2=1,Klimadaten!HX23,\"\")","v":""},null,null,null,{"$f":"IF(IB$2=1,Klimadaten!IB23,\"\")","v":0},null,null,null,{"$f":"IF(IF$2=1,Klimadaten!IF23,\"\")","v":""},null,null,null,{"$f":"IF(IJ$2=1,Klimadaten!IJ23,\"\")","v":""},null,null,null,{"$f":"IF(IN$2=1,Klimadaten!IN23,\"\")","v":""},null,null,null,{"$f":"IF(IR$2=1,Klimadaten!IR23,\"\")","v":""},null,null,null,{"$f":"IF(IV$2=1,Klimadaten!IV23,\"\")","v":""},null,null,null,{"$f":"IF(IZ$2=1,Klimadaten!IZ23,\"\")","v":""},null,null,null,{"$f":"IF(JD$2=1,Klimadaten!JD23,\"\")","v":""},null,null,null,{"$f":"IF(JH$2=1,Klimadaten!JH23,\"\")","v":""},null,null,null,{"$f":"IF(JL$2=1,Klimadaten!JL23,\"\")","v":""}]
[-6,null,null,{"$f":"IF(D$2=1,Klimadaten!D24,\"\")","v":10},null,null,null,{"$f":"IF(H$2=1,Klimadaten!H24,\"\")","v":""},null,null,null,{"$f":"IF(L$2=1,Klimadaten!L24,\"\")","v":""},null,null,null,{"$f":"IF(P$2=1,Klimadaten!P24,\"\")","v":2},null,null,null,{"$f":"IF(T$2=1,Klimadaten!T24,\"\")","v":""},null,null,null,{"$f":"IF(X$2=1,Klimadaten!X24,\"\")","v":""},null,null,null,{"$f":"IF(AB$2=1,Klimadaten!AB24,\"\")","v":""},null,null,null,{"$f":"IF(AF$2=1,Klimadaten!AF24,\"\")","v":""},null,null,null,{"$f":"IF(AJ$2=1,Klimadaten!AJ24,\"\")","v":""},null,null,null,{"$f":"IF(AN$2=1,Klimadaten!AN24,\"\")","v":""},null,null,null,{"$f":"IF(AR$2=1,Klimadaten!AR24,\"\")","v":""},null,null,null,{"$f":"IF(AV$2=1,Klimadaten!AV24,\"\")","v":""},null,null,null,{"$f":"IF(AZ$2=1,Klimadaten!AZ24,\"\")","v":""},null,null,null,{"$f":"IF(BD$2=1,Klimadaten!BD24,\"\")","v":""},null,null,null,{"$f":"IF(BH$2=1,Klimadaten!BH24,\"\")","v":""},null,null,null,{"$f":"IF(BL$2=1,Klimadaten!BL24,\"\")","v":""},null,null,null,{"$f":"IF(BP$2=1,Klimadaten!BP24,\"\")","v":""},null,null,null,{"$f":"IF(BT$2=1,Klimadaten!BT24,\"\")","v":5},null,null,null,{"$f":"IF(BX$2=1,Klimadaten!BX24,\"\")","v":""},null,null,null,{"$f":"IF(CB$2=1,Klimadaten!CB24,\"\")","v":""},null,null,null,{"$f":"IF(CF$2=1,Klimadaten!CF24,\"\")","v":""},null,null,null,{"$f":"IF(CJ$2=1,Klimadaten!CJ24,\"\")","v":""},null,null,null,{"$f":"IF(CN$2=1,Klimadaten!CN24,\"\")","v":""},null,null,null,{"$f":"IF(CR$2=1,Klimadaten!CR24,\"\")","v":""},null,null,null,{"$f":"IF(CV$2=1,Klimadaten!CV24,\"\")","v":""},null,null,null,{"$f":"IF(CZ$2=1,Klimadaten!CZ24,\"\")","v":""},null,null,null,{"$f":"IF(DD$2=1,Klimadaten!DD24,\"\")","v":""},null,null,null,{"$f":"IF(DH$2=1,Klimadaten!DH24,\"\")","v":""},null,null,null,{"$f":"IF(DL$2=1,Klimadaten!DL24,\"\")","v":""},null,null,null,{"$f":"IF(DP$2=1,Klimadaten!DP24,\"\")","v":""},null,null,null,{"$f":"IF(DT$2=1,Klimadaten!DT24,\"\")","v":""},null,null,null,{"$f":"IF(DX$2=1,Klimadaten!DX24,\"\")","v":""},null,null,null,{"$f":"IF(EB$2=1,Klimadaten!EB24,\"\")","v":""},null,null,null,{"$f":"IF(EF$2=1,Klimadaten!EF24,\"\")","v":""},null,null,null,{"$f":"IF(EJ$2=1,Klimadaten!EJ24,\"\")","v":""},null,null,null,{"$f":"IF(EN$2=1,Klimadaten!EN24,\"\")","v":""},null,null,null,{"$f":"IF(ER$2=1,Klimadaten!ER24,\"\")","v":""},null,null,null,{"$f":"IF(EV$2=1,Klimadaten!EV24,\"\")","v":""},null,null,null,{"$f":"IF(EZ$2=1,Klimadaten!EZ24,\"\")","v":""},null,null,null,{"$f":"IF(FD$2=1,Klimadaten!FD24,\"\")","v":""},null,null,null,{"$f":"IF(FH$2=1,Klimadaten!FH24,\"\")","v":""},null,null,null,{"$f":"IF(FL$2=1,Klimadaten!FL24,\"\")","v":""},null,null,null,{"$f":"IF(FP$2=1,Klimadaten!FP24,\"\")","v":""},null,null,null,{"$f":"IF(FT$2=1,Klimadaten!FT24,\"\")","v":""},null,null,null,{"$f":"IF(FX$2=1,Klimadaten!FX24,\"\")","v":""},null,null,null,{"$f":"IF(GB$2=1,Klimadaten!GB24,\"\")","v":""},null,null,null,{"$f":"IF(GF$2=1,Klimadaten!GF24,\"\")","v":""},null,null,null,{"$f":"IF(GJ$2=1,Klimadaten!GJ24,\"\")","v":""},null,null,null,{"$f":"IF(GN$2=1,Klimadaten!GN24,\"\")","v":""},null,null,null,{"$f":"IF(GR$2=1,Klimadaten!GR24,\"\")","v":""},null,null,null,{"$f":"IF(GV$2=1,Klimadaten!GV24,\"\")","v":""},null,null,null,{"$f":"IF(GZ$2=1,Klimadaten!GZ24,\"\")","v":""},null,null,null,{"$f":"IF(HD$2=1,Klimadaten!HD24,\"\")","v":""},null,null,null,{"$f":"IF(HH$2=1,Klimadaten!HH24,\"\")","v":""},null,null,null,{"$f":"IF(HL$2=1,Klimadaten!HL24,\"\")","v":""},null,null,null,{"$f":"IF(HP$2=1,Klimadaten!HP24,\"\")","v":""},null,null,null,{"$f":"IF(HT$2=1,Klimadaten!HT24,\"\")","v":""},null,null,null,{"$f":"IF(HX$2=1,Klimadaten!HX24,\"\")","v":""},null,null,null,{"$f":"IF(IB$2=1,Klimadaten!IB24,\"\")","v":0},null,null,null,{"$f":"IF(IF$2=1,Klimadaten!IF24,\"\")","v":""},null,null,null,{"$f":"IF(IJ$2=1,Klimadaten!IJ24,\"\")","v":""},null,null,null,{"$f":"IF(IN$2=1,Klimadaten!IN24,\"\")","v":""},null,null,null,{"$f":"IF(IR$2=1,Klimadaten!IR24,\"\")","v":""},null,null,null,{"$f":"IF(IV$2=1,Klimadaten!IV24,\"\")","v":""},null,null,null,{"$f":"IF(IZ$2=1,Klimadaten!IZ24,\"\")","v":""},null,null,null,{"$f":"IF(JD$2=1,Klimadaten!JD24,\"\")","v":""},null,null,null,{"$f":"IF(JH$2=1,Klimadaten!JH24,\"\")","v":""},null,null,null,{"$f":"IF(JL$2=1,Klimadaten!JL24,\"\")","v":""}]
[-5,null,null,{"$f":"IF(D$2=1,Klimadaten!D25,\"\")","v":13},null,null,null,{"$f":"IF(H$2=1,Klimadaten!H25,\"\")","v":""},null,null,null,{"$f":"IF(L$2=1,Klimadaten!L25,\"\")","v":""},null,null,null,{"$f":"IF(P$2=1,Klimadaten!P25,\"\")","v":4},null,null,null,{"$f":"IF(T$2=1,Klimadaten!T25,\"\")","v":""},null,null,null,{"$f":"IF(X$2=1,Klimadaten!X25,\"\")","v":""},null,null,null,{"$f":"IF(AB$2=1,Klimadaten!AB25,\"\")","v":""},null,null,null,{"$f":"IF(AF$2=1,Klimadaten!AF25,\"\")","v":""},null,null,null,{"$f":"IF(AJ$2=1,Klimadaten!AJ25,\"\")","v":""},null,null,null,{"$f":"IF(AN$2=1,Klimadaten!AN25,\"\")","v":""},null,null,null,{"$f":"IF(AR$2=1,Klimadaten!AR25,\"\")","v":""},null,null,null,{"$f":"IF(AV$2=1,Klimadaten!AV25,\"\")","v":""},null,null,null,{"$f":"IF(AZ$2=1,Klimadaten!AZ25,\"\")","v":""},null,null,null,{"$f":"IF(BD$2=1,Klimadaten!BD25,\"\")","v":""},null,null,null,{"$f":"IF(BH$2=1,Klimadaten!BH25,\"\")","v":""},null,null,null,{"$f":"IF(BL$2=1,Klimadaten!BL25,\"\")","v":""},null,null,null,{"$f":"IF(BP$2=1,Klimadaten!BP25,\"\")","v":""},null,null,null,{"$f":"IF(BT$2=1,Klimadaten!BT25,\"\")","v":6},null,null,null,{"$f":"IF(BX$2=1,Klimadaten!BX25,\"\")","v":""},null,null,null,{"$f":"IF(CB$2=1,Klimadaten!CB25,\"\")","v":""},null,null,null,{"$f":"IF(CF$2=1,Klimadaten!CF25,\"\")","v":""},null,null,null,{"$f":"IF(CJ$2=1,Klimadaten!CJ25,\"\")","v":""},null,null,null,{"$f":"IF(CN$2=1,Klimadaten!CN25,\"\")","v":""},null,null,null,{"$f":"IF(CR$2=1,Klimadaten!CR25,\"\")","v":""},null,null,null,{"$f":"IF(CV$2=1,Klimadaten!CV25,\"\")","v":""},null,null,null,{"$f":"IF(CZ$2=1,Klimadaten!CZ25,\"\")","v":""},null,null,null,{"$f":"IF(DD$2=1,Klimadaten!DD25,\"\")","v":""},null,null,null,{"$f":"IF(DH$2=1,Klimadaten!DH25,\"\")","v":""},null,null,null,{"$f":"IF(DL$2=1,Klimadaten!DL25,\"\")","v":""},null,null,null,{"$f":"IF(DP$2=1,Klimadaten!DP25,\"\")","v":""},null,null,null,{"$f":"IF(DT$2=1,Klimadaten!DT25,\"\")","v":""},null,null,null,{"$f":"IF(DX$2=1,Klimadaten!DX25,\"\")","v":""},null,null,null,{"$f":"IF(EB$2=1,Klimadaten!EB25,\"\")","v":""},null,null,null,{"$f":"IF(EF$2=1,Klimadaten!EF25,\"\")","v":""},null,null,null,{"$f":"IF(EJ$2=1,Klimadaten!EJ25,\"\")","v":""},null,null,null,{"$f":"IF(EN$2=1,Klimadaten!EN25,\"\")","v":""},null,null,null,{"$f":"IF(ER$2=1,Klimadaten!ER25,\"\")","v":""},null,null,null,{"$f":"IF(EV$2=1,Klimadaten!EV25,\"\")","v":""},null,null,null,{"$f":"IF(EZ$2=1,Klimadaten!EZ25,\"\")","v":""},null,null,null,{"$f":"IF(FD$2=1,Klimadaten!FD25,\"\")","v":""},null,null,null,{"$f":"IF(FH$2=1,Klimadaten!FH25,\"\")","v":""},null,null,null,{"$f":"IF(FL$2=1,Klimadaten!FL25,\"\")","v":""},null,null,null,{"$f":"IF(FP$2=1,Klimadaten!FP25,\"\")","v":""},null,null,null,{"$f":"IF(FT$2=1,Klimadaten!FT25,\"\")","v":""},null,null,null,{"$f":"IF(FX$2=1,Klimadaten!FX25,\"\")","v":""},null,null,null,{"$f":"IF(GB$2=1,Klimadaten!GB25,\"\")","v":""},null,null,null,{"$f":"IF(GF$2=1,Klimadaten!GF25,\"\")","v":""},null,null,null,{"$f":"IF(GJ$2=1,Klimadaten!GJ25,\"\")","v":""},null,null,null,{"$f":"IF(GN$2=1,Klimadaten!GN25,\"\")","v":""},null,null,null,{"$f":"IF(GR$2=1,Klimadaten!GR25,\"\")","v":""},null,null,null,{"$f":"IF(GV$2=1,Klimadaten!GV25,\"\")","v":""},null,null,null,{"$f":"IF(GZ$2=1,Klimadaten!GZ25,\"\")","v":""},null,null,null,{"$f":"IF(HD$2=1,Klimadaten!HD25,\"\")","v":""},null,null,null,{"$f":"IF(HH$2=1,Klimadaten!HH25,\"\")","v":""},null,null,null,{"$f":"IF(HL$2=1,Klimadaten!HL25,\"\")","v":""},null,null,null,{"$f":"IF(HP$2=1,Klimadaten!HP25,\"\")","v":""},null,null,null,{"$f":"IF(HT$2=1,Klimadaten!HT25,\"\")","v":""},null,null,null,{"$f":"IF(HX$2=1,Klimadaten!HX25,\"\")","v":""},null,null,null,{"$f":"IF(IB$2=1,Klimadaten!IB25,\"\")","v":0},null,null,null,{"$f":"IF(IF$2=1,Klimadaten!IF25,\"\")","v":""},null,null,null,{"$f":"IF(IJ$2=1,Klimadaten!IJ25,\"\")","v":""},null,null,null,{"$f":"IF(IN$2=1,Klimadaten!IN25,\"\")","v":""},null,null,null,{"$f":"IF(IR$2=1,Klimadaten!IR25,\"\")","v":""},null,null,null,{"$f":"IF(IV$2=1,Klimadaten!IV25,\"\")","v":""},null,null,null,{"$f":"IF(IZ$2=1,Klimadaten!IZ25,\"\")","v":""},null,null,null,{"$f":"IF(JD$2=1,Klimadaten!JD25,\"\")","v":""},null,null,null,{"$f":"IF(JH$2=1,Klimadaten!JH25,\"\")","v":""},null,null,null,{"$f":"IF(JL$2=1,Klimadaten!JL25,\"\")","v":""}]
[-4,null,null,{"$f":"IF(D$2=1,Klimadaten!D26,\"\")","v":13},null,null,null,{"$f":"IF(H$2=1,Klimadaten!H26,\"\")","v":""},null,null,null,{"$f":"IF(L$2=1,Klimadaten!L26,\"\")","v":""},null,null,null,{"$f":"IF(P$2=1,Klimadaten!P26,\"\")","v":5},null,null,null,{"$f":"IF(T$2=1,Klimadaten!T26,\"\")","v":""},null,null,null,{"$f":"IF(X$2=1,Klimadaten!X26,\"\")","v":""},null,null,null,{"$f":"IF(AB$2=1,Klimadaten!AB26,\"\")","v":""},null,null,null,{"$f":"IF(AF$2=1,Klimadaten!AF26,\"\")","v":""},null,null,null,{"$f":"IF(AJ$2=1,Klimadaten!AJ26,\"\")","v":""},null,null,null,{"$f":"IF(AN$2=1,Klimadaten!AN26,\"\")","v":""},null,null,null,{"$f":"IF(AR$2=1,Klimadaten!AR26,\"\")","v":""},null,null,null,{"$f":"IF(AV$2=1,Klimadaten!AV26,\"\")","v":""},null,null,null,{"$f":"IF(AZ$2=1,Klimadaten!AZ26,\"\")","v":""},null,null,null,{"$f":"IF(BD$2=1,Klimadaten!BD26,\"\")","v":""},null,null,null,{"$f":"IF(BH$2=1,Klimadaten!BH26,\"\")","v":""},null,null,null,{"$f":"IF(BL$2=1,Klimadaten!BL26,\"\")","v":""},null,null,null,{"$f":"IF(BP$2=1,Klimadaten!BP26,\"\")","v":""},null,null,null,{"$f":"IF(BT$2=1,Klimadaten!BT26,\"\")","v":9},null,null,null,{"$f":"IF(BX$2=1,Klimadaten!BX26,\"\")","v":""},null,null,null,{"$f":"IF(CB$2=1,Klimadaten!CB26,\"\")","v":""},null,null,null,{"$f":"IF(CF$2=1,Klimadaten!CF26,\"\")","v":""},null,null,null,{"$f":"IF(CJ$2=1,Klimadaten!CJ26,\"\")","v":""},null,null,null,{"$f":"IF(CN$2=1,Klimadaten!CN26,\"\")","v":""},null,null,null,{"$f":"IF(CR$2=1,Klimadaten!CR26,\"\")","v":""},null,null,null,{"$f":"IF(CV$2=1,Klimadaten!CV26,\"\")","v":""},null,null,null,{"$f":"IF(CZ$2=1,Klimadaten!CZ26,\"\")","v":""},null,null,null,{"$f":"IF(DD$2=1,Klimadaten!DD26,\"\")","v":""},null,null,null,{"$f":"IF(DH$2=1,Klimadaten!DH26,\"\")","v":""},null,null,null,{"$f":"IF(DL$2=1,Klimadaten!DL26,\"\")","v":""},null,null,null,{"$f":"IF(DP$2=1,Klimadaten!DP26,\"\")","v":""},null,null,null,{"$f":"IF(DT$2=1,Klimadaten!DT26,\"\")","v":""},null,null,null,{"$f":"IF(DX$2=1,Klimadaten!DX26,\"\")","v":""},null,null,null,{"$f":"IF(EB$2=1,Klimadaten!EB26,\"\")","v":""},null,null,null,{"$f":"IF(EF$2=1,Klimadaten!EF26,\"\")","v":""},null,null,null,{"$f":"IF(EJ$2=1,Klimadaten!EJ26,\"\")","v":""},null,null,null,{"$f":"IF(EN$2=1,Klimadaten!EN26,\"\")","v":""},null,null,null,{"$f":"IF(ER$2=1,Klimadaten!ER26,\"\")","v":""},null,null,null,{"$f":"IF(EV$2=1,Klimadaten!EV26,\"\")","v":""},null,null,null,{"$f":"IF(EZ$2=1,Klimadaten!EZ26,\"\")","v":""},null,null,null,{"$f":"IF(FD$2=1,Klimadaten!FD26,\"\")","v":""},null,null,null,{"$f":"IF(FH$2=1,Klimadaten!FH26,\"\")","v":""},null,null,null,{"$f":"IF(FL$2=1,Klimadaten!FL26,\"\")","v":""},null,null,null,{"$f":"IF(FP$2=1,Klimadaten!FP26,\"\")","v":""},null,null,null,{"$f":"IF(FT$2=1,Klimadaten!FT26,\"\")","v":""},null,null,null,{"$f":"IF(FX$2=1,Klimadaten!FX26,\"\")","v":""},null,null,null,{"$f":"IF(GB$2=1,Klimadaten!GB26,\"\")","v":""},null,null,null,{"$f":"IF(GF$2=1,Klimadaten!GF26,\"\")","v":""},null,null,null,{"$f":"IF(GJ$2=1,Klimadaten!GJ26,\"\")","v":""},null,null,null,{"$f":"IF(GN$2=1,Klimadaten!GN26,\"\")","v":""},null,null,null,{"$f":"IF(GR$2=1,Klimadaten!GR26,\"\")","v":""},null,null,null,{"$f":"IF(GV$2=1,Klimadaten!GV26,\"\")","v":""},null,null,null,{"$f":"IF(GZ$2=1,Klimadaten!GZ26,\"\")","v":""},null,null,null,{"$f":"IF(HD$2=1,Klimadaten!HD26,\"\")","v":""},null,null,null,{"$f":"IF(HH$2=1,Klimadaten!HH26,\"\")","v":""},null,null,null,{"$f":"IF(HL$2=1,Klimadaten!HL26,\"\")","v":""},null,null,null,{"$f":"IF(HP$2=1,Klimadaten!HP26,\"\")","v":""},null,null,null,{"$f":"IF(HT$2=1,Klimadaten!HT26,\"\")","v":""},null,null,null,{"$f":"IF(HX$2=1,Klimadaten!HX26,\"\")","v":""},null,null,null,{"$f":"IF(IB$2=1,Klimadaten!IB26,\"\")","v":0},null,null,null,{"$f":"IF(IF$2=1,Klimadaten!IF26,\"\")","v":""},null,null,null,{"$f":"IF(IJ$2=1,Klimadaten!IJ26,\"\")","v":""},null,null,null,{"$f":"IF(IN$2=1,Klimadaten!IN26,\"\")","v":""},null,null,null,{"$f":"IF(IR$2=1,Klimadaten!IR26,\"\")","v":""},null,null,null,{"$f":"IF(IV$2=1,Klimadaten!IV26,\"\")","v":""},null,null,null,{"$f":"IF(IZ$2=1,Klimadaten!IZ26,\"\")","v":""},null,null,null,{"$f":"IF(JD$2=1,Klimadaten!JD26,\"\")","v":""},null,null,null,{"$f":"IF(JH$2=1,Klimadaten!JH26,\"\")","v":""},null,null,null,{"$f":"IF(JL$2=1,Klimadaten!JL26,\"\")","v":""}]
[-3,null,null,{"$f":"IF(D$2=1,Klimadaten!D27,\"\")","v":13},null,null,null,{"$f":"IF(H$2=1,Klimadaten!H27,\"\")","v":""},null,null,null,{"$f":"IF(L$2=1,Klimadaten!L27,\"\")","v":""},null,null,null,{"$f":"IF(P$2=1,Klimadaten!P27,\"\")","v":6},null,null,null,{"$f":"IF(T$2=1,Klimadaten!T27,\"\")","v":""},null,null,null,{"$f":"IF(X$2=1,Klimadaten!X27,\"\")","v":""},null,null,null,{"$f":"IF(AB$2=1,Klimadaten!AB27,\"\")","v":""},null,null,null,{"$f":"IF(AF$2=1,Klimadaten!AF27,\"\")","v":""},null,null,null,{"$f":"IF(AJ$2=1,Klimadaten!AJ27,\"\")","v":""},null,null,null,{"$f":"IF(AN$2=1,Klimadaten!AN27,\"\")","v":""},null,null,null,{"$f":"IF(AR$2=1,Klimadaten!AR27,\"\")","v":""},null,null,null,{"$f":"IF(AV$2=1,Klimadaten!AV27,\"\")","v":""},null,null,null,{"$f":"IF(AZ$2=1,Klimadaten!AZ27,\"\")","v":""},null,null,null,{"$f":"IF(BD$2=1,Klimadaten!BD27,\"\")","v":""},null,null,null,{"$f":"IF(BH$2=1,Klimadaten!BH27,\"\")","v":""},null,null,null,{"$f":"IF(BL$2=1,Klimadaten!BL27,\"\")","v":""},null,null,null,{"$f":"IF(BP$2=1,Klimadaten!BP27,\"\")","v":""},null,null,null,{"$f":"IF(BT$2=1,Klimadaten!BT27,\"\")","v":9},null,null,null,{"$f":"IF(BX$2=1,Klimadaten!BX27,\"\")","v":""},null,null,null,{"$f":"IF(CB$2=1,Klimadaten!CB27,\"\")","v":""},null,null,null,{"$f":"IF(CF$2=1,Klimadaten!CF27,\"\")","v":""},null,null,null,{"$f":"IF(CJ$2=1,Klimadaten!CJ27,\"\")","v":""},null,null,null,{"$f":"IF(CN$2=1,Klimadaten!CN27,\"\")","v":""},null,null,null,{"$f":"IF(CR$2=1,Klimadaten!CR27,\"\")","v":""},null,null,null,{"$f":"IF(CV$2=1,Klimadaten!CV27,\"\")","v":""},null,null,null,{"$f":"IF(CZ$2=1,Klimadaten!CZ27,\"\")","v":""},null,null,null,{"$f":"IF(DD$2=1,Klimadaten!DD27,\"\")","v":""},null,null,null,{"$f":"IF(DH$2=1,Klimadaten!DH27,\"\")","v":""},null,null,null,{"$f":"IF(DL$2=1,Klimadaten!DL27,\"\")","v":""},null,null,null,{"$f":"IF(DP$2=1,Klimadaten!DP27,\"\")","v":""},null,null,null,{"$f":"IF(DT$2=1,Klimadaten!DT27,\"\")","v":""},null,null,null,{"$f":"IF(DX$2=1,Klimadaten!DX27,\"\")","v":""},null,null,null,{"$f":"IF(EB$2=1,Klimadaten!EB27,\"\")","v":""},null,null,null,{"$f":"IF(EF$2=1,Klimadaten!EF27,\"\")","v":""},null,null,null,{"$f":"IF(EJ$2=1,Klimadaten!EJ27,\"\")","v":""},null,null,null,{"$f":"IF(EN$2=1,Klimadaten!EN27,\"\")","v":""},null,null,null,{"$f":"IF(ER$2=1,Klimadaten!ER27,\"\")","v":""},null,null,null,{"$f":"IF(EV$2=1,Klimadaten!EV27,\"\")","v":""},null,null,null,{"$f":"IF(EZ$2=1,Klimadaten!EZ27,\"\")","v":""},null,null,null,{"$f":"IF(FD$2=1,Klimadaten!FD27,\"\")","v":""},null,null,null,{"$f":"IF(FH$2=1,Klimadaten!FH27,\"\")","v":""},null,null,null,{"$f":"IF(FL$2=1,Klimadaten!FL27,\"\")","v":""},null,null,null,{"$f":"IF(FP$2=1,Klimadaten!FP27,\"\")","v":""},null,null,null,{"$f":"IF(FT$2=1,Klimadaten!FT27,\"\")","v":""},null,null,null,{"$f":"IF(FX$2=1,Klimadaten!FX27,\"\")","v":""},null,null,null,{"$f":"IF(GB$2=1,Klimadaten!GB27,\"\")","v":""},null,null,null,{"$f":"IF(GF$2=1,Klimadaten!GF27,\"\")","v":""},null,null,null,{"$f":"IF(GJ$2=1,Klimadaten!GJ27,\"\")","v":""},null,null,null,{"$f":"IF(GN$2=1,Klimadaten!GN27,\"\")","v":""},null,null,null,{"$f":"IF(GR$2=1,Klimadaten!GR27,\"\")","v":""},null,null,null,{"$f":"IF(GV$2=1,Klimadaten!GV27,\"\")","v":""},null,null,null,{"$f":"IF(GZ$2=1,Klimadaten!GZ27,\"\")","v":""},null,null,null,{"$f":"IF(HD$2=1,Klimadaten!HD27,\"\")","v":""},null,null,null,{"$f":"IF(HH$2=1,Klimadaten!HH27,\"\")","v":""},null,null,null,{"$f":"IF(HL$2=1,Klimadaten!HL27,\"\")","v":""},null,null,null,{"$f":"IF(HP$2=1,Klimadaten!HP27,\"\")","v":""},null,null,null,{"$f":"IF(HT$2=1,Klimadaten!HT27,\"\")","v":""},null,null,null,{"$f":"IF(HX$2=1,Klimadaten!HX27,\"\")","v":""},null,null,null,{"$f":"IF(IB$2=1,Klimadaten!IB27,\"\")","v":0},null,null,null,{"$f":"IF(IF$2=1,Klimadaten!IF27,\"\")","v":""},null,null,null,{"$f":"IF(IJ$2=1,Klimadaten!IJ27,\"\")","v":""},null,null,null,{"$f":"IF(IN$2=1,Klimadaten!IN27,\"\")","v":""},null,null,null,{"$f":"IF(IR$2=1,Klimadaten!IR27,\"\")","v":""},null,null,null,{"$f":"IF(IV$2=1,Klimadaten!IV27,\"\")","v":""},null,null,null,{"$f":"IF(IZ$2=1,Klimadaten!IZ27,\"\")","v":""},null,null,null,{"$f":"IF(JD$2=1,Klimadaten!JD27,\"\")","v":""},null,null,null,{"$f":"IF(JH$2=1,Klimadaten!JH27,\"\")","v":""},null,null,null,{"$f":"IF(JL$2=1,Klimadaten!JL27,\"\")","v":""}]
[-2,null,null,{"$f":"IF(D$2=1,Klimadaten!D28,\"\")","v":15},null,null,null,{"$f":"IF(H$2=1,Klimadaten!H28,\"\")","v":""},null,null,null,{"$f":"IF(L$2=1,Klimadaten!L28,\"\")","v":""},null,null,null,{"$f":"IF(P$2=1,Klimadaten!P28,\"\")","v":7},null,null,null,{"$f":"IF(T$2=1,Klimadaten!T28,\"\")","v":""},null,null,null,{"$f":"IF(X$2=1,Klimadaten!X28,\"\")","v":""},null,null,null,{"$f":"IF(AB$2=1,Klimadaten!AB28,\"\")","v":""},null,null,null,{"$f":"IF(AF$2=1,Klimadaten!AF28,\"\")","v":""},null,null,null,{"$f":"IF(AJ$2=1,Klimadaten!AJ28,\"\")","v":""},null,null,null,{"$f":"IF(AN$2=1,Klimadaten!AN28,\"\")","v":""},null,null,null,{"$f":"IF(AR$2=1,Klimadaten!AR28,\"\")","v":""},null,null,null,{"$f":"IF(AV$2=1,Klimadaten!AV28,\"\")","v":""},null,null,null,{"$f":"IF(AZ$2=1,Klimadaten!AZ28,\"\")","v":""},null,null,null,{"$f":"IF(BD$2=1,Klimadaten!BD28,\"\")","v":""},null,null,null,{"$f":"IF(BH$2=1,Klimadaten!BH28,\"\")","v":""},null,null,null,{"$f":"IF(BL$2=1,Klimadaten!BL28,\"\")","v":""},null,null,null,{"$f":"IF(BP$2=1,Klimadaten!BP28,\"\")","v":""},null,null,null,{"$f":"IF(BT$2=1,Klimadaten!BT28,\"\")","v":11},null,null,null,{"$f":"IF(BX$2=1,Klimadaten!BX28,\"\")","v":""},null,null,null,{"$f":"IF(CB$2=1,Klimadaten!CB28,\"\")","v":""},null,null,null,{"$f":"IF(CF$2=1,Klimadaten!CF28,\"\")","v":""},null,null,null,{"$f":"IF(CJ$2=1,Klimadaten!CJ28,\"\")","v":""},null,null,null,{"$f":"IF(CN$2=1,Klimadaten!CN28,\"\")","v":""},null,null,null,{"$f":"IF(CR$2=1,Klimadaten!CR28,\"\")","v":""},null,null,null,{"$f":"IF(CV$2=1,Klimadaten!CV28,\"\")","v":""},null,null,null,{"$f":"IF(CZ$2=1,Klimadaten!CZ28,\"\")","v":""},null,null,null,{"$f":"IF(DD$2=1,Klimadaten!DD28,\"\")","v":""},null,null,null,{"$f":"IF(DH$2=1,Klimadaten!DH28,\"\")","v":""},null,null,null,{"$f":"IF(DL$2=1,Klimadaten!DL28,\"\")","v":""},null,null,null,{"$f":"IF(DP$2=1,Klimadaten!DP28,\"\")","v":""},null,null,null,{"$f":"IF(DT$2=1,Klimadaten!DT28,\"\")","v":""},null,null,null,{"$f":"IF(DX$2=1,Klimadaten!DX28,\"\")","v":""},null,null,null,{"$f":"IF(EB$2=1,Klimadaten!EB28,\"\")","v":""},null,null,null,{"$f":"IF(EF$2=1,Klimadaten!EF28,\"\")","v":""},null,null,null,{"$f":"IF(EJ$2=1,Klimadaten!EJ28,\"\")","v":""},null,null,null,{"$f":"IF(EN$2=1,Klimadaten!EN28,\"\")","v":""},null,null,null,{"$f":"IF(ER$2=1,Klimadaten!ER28,\"\")","v":""},null,null,null,{"$f":"IF(EV$2=1,Klimadaten!EV28,\"\")","v":""},null,null,null,{"$f":"IF(EZ$2=1,Klimadaten!EZ28,\"\")","v":""},null,null,null,{"$f":"IF(FD$2=1,Klimadaten!FD28,\"\")","v":""},null,null,null,{"$f":"IF(FH$2=1,Klimadaten!FH28,\"\")","v":""},null,null,null,{"$f":"IF(FL$2=1,Klimadaten!FL28,\"\")","v":""},null,null,null,{"$f":"IF(FP$2=1,Klimadaten!FP28,\"\")","v":""},null,null,null,{"$f":"IF(FT$2=1,Klimadaten!FT28,\"\")","v":""},null,null,null,{"$f":"IF(FX$2=1,Klimadaten!FX28,\"\")","v":""},null,null,null,{"$f":"IF(GB$2=1,Klimadaten!GB28,\"\")","v":""},null,null,null,{"$f":"IF(GF$2=1,Klimadaten!GF28,\"\")","v":""},null,null,null,{"$f":"IF(GJ$2=1,Klimadaten!GJ28,\"\")","v":""},null,null,null,{"$f":"IF(GN$2=1,Klimadaten!GN28,\"\")","v":""},null,null,null,{"$f":"IF(GR$2=1,Klimadaten!GR28,\"\")","v":""},null,null,null,{"$f":"IF(GV$2=1,Klimadaten!GV28,\"\")","v":""},null,null,null,{"$f":"IF(GZ$2=1,Klimadaten!GZ28,\"\")","v":""},null,null,null,{"$f":"IF(HD$2=1,Klimadaten!HD28,\"\")","v":""},null,null,null,{"$f":"IF(HH$2=1,Klimadaten!HH28,\"\")","v":""},null,null,null,{"$f":"IF(HL$2=1,Klimadaten!HL28,\"\")","v":""},null,null,null,{"$f":"IF(HP$2=1,Klimadaten!HP28,\"\")","v":""},null,null,null,{"$f":"IF(HT$2=1,Klimadaten!HT28,\"\")","v":""},null,null,null,{"$f":"IF(HX$2=1,Klimadaten!HX28,\"\")","v":""},null,null,null,{"$f":"IF(IB$2=1,Klimadaten!IB28,\"\")","v":1},null,null,null,{"$f":"IF(IF$2=1,Klimadaten!IF28,\"\")","v":""},null,null,null,{"$f":"IF(IJ$2=1,Klimadaten!IJ28,\"\")","v":""},null,null,null,{"$f":"IF(IN$2=1,Klimadaten!IN28,\"\")","v":""},null,null,null,{"$f":"IF(IR$2=1,Klimadaten!IR28,\"\")","v":""},null,null,null,{"$f":"IF(IV$2=1,Klimadaten!IV28,\"\")","v":""},null,null,null,{"$f":"IF(IZ$2=1,Klimadaten!IZ28,\"\")","v":""},null,null,null,{"$f":"IF(JD$2=1,Klimadaten!JD28,\"\")","v":""},null,null,null,{"$f":"IF(JH$2=1,Klimadaten!JH28,\"\")","v":""},null,null,null,{"$f":"IF(JL$2=1,Klimadaten!JL28,\"\")","v":""}]
[-1,null,null,{"$f":"IF(D$2=1,Klimadaten!D29,\"\")","v":15},null,null,null,{"$f":"IF(H$2=1,Klimadaten!H29,\"\")","v":""},null,null,null,{"$f":"IF(L$2=1,Klimadaten!L29,\"\")","v":""},null,null,null,{"$f":"IF(P$2=1,Klimadaten!P29,\"\")","v":9},null,null,null,{"$f":"IF(T$2=1,Klimadaten!T29,\"\")","v":""},null,null,null,{"$f":"IF(X$2=1,Klimadaten!X29,\"\")","v":""},null,null,null,{"$f":"IF(AB$2=1,Klimadaten!AB29,\"\")","v":""},null,null,null,{"$f":"IF(AF$2=1,Klimadaten!AF29,\"\")","v":""},null,null,null,{"$f":"IF(AJ$2=1,Klimadaten!AJ29,\"\")","v":""},null,null,null,{"$f":"IF(AN$2=1,Klimadaten!AN29,\"\")","v":""},null,null,null,{"$f":"IF(AR$2=1,Klimadaten!AR29,\"\")","v":""},null,null,null,{"$f":"IF(AV$2=1,Klimadaten!AV29,\"\")","v":""},null,null,null,{"$f":"IF(AZ$2=1,Klimadaten!AZ29,\"\")","v":""},null,null,null,{"$f":"IF(BD$2=1,Klimadaten!BD29,\"\")","v":""},null,null,null,{"$f":"IF(BH$2=1,Klimadaten!BH29,\"\")","v":""},null,null,null,{"$f":"IF(BL$2=1,Klimadaten!BL29,\"\")","v":""},null,null,null,{"$f":"IF(BP$2=1,Klimadaten!BP29,\"\")","v":""},null,null,null,{"$f":"IF(BT$2=1,Klimadaten!BT29,\"\")","v":12},null,null,null,{"$f":"IF(BX$2=1,Klimadaten!BX29,\"\")","v":""},null,null,null,{"$f":"IF(CB$2=1,Klimadaten!CB29,\"\")","v":""},null,null,null,{"$f":"IF(CF$2=1,Klimadaten!CF29,\"\")","v":""},null,null,null,{"$f":"IF(CJ$2=1,Klimadaten!CJ29,\"\")","v":""},null,null,null,{"$f":"IF(CN$2=1,Klimadaten!CN29,\"\")","v":""},null,null,null,{"$f":"IF(CR$2=1,Klimadaten!CR29,\"\")","v":""},null,null,null,{"$f":"IF(CV$2=1,Klimadaten!CV29,\"\")","v":""},null,null,null,{"$f":"IF(CZ$2=1,Klimadaten!CZ29,\"\")","v":""},null,null,null,{"$f":"IF(DD$2=1,Klimadaten!DD29,\"\")","v":""},null,null,null,{"$f":"IF(DH$2=1,Klimadaten!DH29,\"\")","v":""},null,null,null,{"$f":"IF(DL$2=1,Klimadaten!DL29,\"\")","v":""},null,null,null,{"$f":"IF(DP$2=1,Klimadaten!DP29,\"\")","v":""},null,null,null,{"$f":"IF(DT$2=1,Klimadaten!DT29,\"\")","v":""},null,null,null,{"$f":"IF(DX$2=1,Klimadaten!DX29,\"\")","v":""},null,null,null,{"$f":"IF(EB$2=1,Klimadaten!EB29,\"\")","v":""},null,null,null,{"$f":"IF(EF$2=1,Klimadaten!EF29,\"\")","v":""},null,null,null,{"$f":"IF(EJ$2=1,Klimadaten!EJ29,\"\")","v":""},null,null,null,{"$f":"IF(EN$2=1,Klimadaten!EN29,\"\")","v":""},null,null,null,{"$f":"IF(ER$2=1,Klimadaten!ER29,\"\")","v":""},null,null,null,{"$f":"IF(EV$2=1,Klimadaten!EV29,\"\")","v":""},null,null,null,{"$f":"IF(EZ$2=1,Klimadaten!EZ29,\"\")","v":""},null,null,null,{"$f":"IF(FD$2=1,Klimadaten!FD29,\"\")","v":""},null,null,null,{"$f":"IF(FH$2=1,Klimadaten!FH29,\"\")","v":""},null,null,null,{"$f":"IF(FL$2=1,Klimadaten!FL29,\"\")","v":""},null,null,null,{"$f":"IF(FP$2=1,Klimadaten!FP29,\"\")","v":""},null,null,null,{"$f":"IF(FT$2=1,Klimadaten!FT29,\"\")","v":""},null,null,null,{"$f":"IF(FX$2=1,Klimadaten!FX29,\"\")","v":""},null,null,null,{"$f":"IF(GB$2=1,Klimadaten!GB29,\"\")","v":""},null,null,null,{"$f":"IF(GF$2=1,Klimadaten!GF29,\"\")","v":""},null,null,null,{"$f":"IF(GJ$2=1,Klimadaten!GJ29,\"\")","v":""},null,null,null,{"$f":"IF(GN$2=1,Klimadaten!GN29,\"\")","v":""},null,null,null,{"$f":"IF(GR$2=1,Klimadaten!GR29,\"\")","v":""},null,null,null,{"$f":"IF(GV$2=1,Klimadaten!GV29,\"\")","v":""},null,null,null,{"$f":"IF(GZ$2=1,Klimadaten!GZ29,\"\")","v":""},null,null,null,{"$f":"IF(HD$2=1,Klimadaten!HD29,\"\")","v":""},null,null,null,{"$f":"IF(HH$2=1,Klimadaten!HH29,\"\")","v":""},null,null,null,{"$f":"IF(HL$2=1,Klimadaten!HL29,\"\")","v":""},null,null,null,{"$f":"IF(HP$2=1,Klimadaten!HP29,\"\")","v":""},null,null,null,{"$f":"IF(HT$2=1,Klimadaten!HT29,\"\")","v":""},null,null,null,{"$f":"IF(HX$2=1,Klimadaten!HX29,\"\")","v":""},null,null,null,{"$f":"IF(IB$2=1,Klimadaten!IB29,\"\")","v":2},null,null,null,{"$f":"IF(IF$2=1,Klimadaten!IF29,\"\")","v":""},null,null,null,{"$f":"IF(IJ$2=1,Klimadaten!IJ29,\"\")","v":""},null,null,null,{"$f":"IF(IN$2=1,Klimadaten!IN29,\"\")","v":""},null,null,null,{"$f":"IF(IR$2=1,Klimadaten!IR29,\"\")","v":""},null,null,null,{"$f":"IF(IV$2=1,Klimadaten!IV29,\"\")","v":""},null,null,null,{"$f":"IF(IZ$2=1,Klimadaten!IZ29,\"\")","v":""},null,null,null,{"$f":"IF(JD$2=1,Klimadaten!JD29,\"\")","v":""},null,null,null,{"$f":"IF(JH$2=1,Klimadaten!JH29,\"\")","v":""},null,null,null,{"$f":"IF(JL$2=1,Klimadaten!JL29,\"\")","v":""}]
[0,null,null,{"$f":"IF(D$2=1,Klimadaten!D30,\"\")","v":14},null,null,null,{"$f":"IF(H$2=1,Klimadaten!H30,\"\")","v":""},null,null,null,{"$f":"IF(L$2=1,Klimadaten!L30,\"\")","v":""},null,null,null,{"$f":"IF(P$2=1,Klimadaten!P30,\"\")","v":12},null,null,null,{"$f":"IF(T$2=1,Klimadaten!T30,\"\")","v":""},null,null,null,{"$f":"IF(X$2=1,Klimadaten!X30,\"\")","v":""},null,null,null,{"$f":"IF(AB$2=1,Klimadaten!AB30,\"\")","v":""},null,null,null,{"$f":"IF(AF$2=1,Klimadaten!AF30,\"\")","v":""},null,null,null,{"$f":"IF(AJ$2=1,Klimadaten!AJ30,\"\")","v":""},null,null,null,{"$f":"IF(AN$2=1,Klimadaten!AN30,\"\")","v":""},null,null,null,{"$f":"IF(AR$2=1,Klimadaten!AR30,\"\")","v":""},null,null,null,{"$f":"IF(AV$2=1,Klimadaten!AV30,\"\")","v":""},null,null,null,{"$f":"IF(AZ$2=1,Klimadaten!AZ30,\"\")","v":""},null,null,null,{"$f":"IF(BD$2=1,Klimadaten!BD30,\"\")","v":""},null,null,null,{"$f":"IF(BH$2=1,Klimadaten!BH30,\"\")","v":""},null,null,null,{"$f":"IF(BL$2=1,Klimadaten!BL30,\"\")","v":""},null,null,null,{"$f":"IF(BP$2=1,Klimadaten!BP30,\"\")","v":""},null,null,null,{"$f":"IF(BT$2=1,Klimadaten!BT30,\"\")","v":15},null,null,null,{"$f":"IF(BX$2=1,Klimadaten!BX30,\"\")","v":""},null,null,null,{"$f":"IF(CB$2=1,Klimadaten!CB30,\"\")","v":""},null,null,null,{"$f":"IF(CF$2=1,Klimadaten!CF30,\"\")","v":""},null,null,null,{"$f":"IF(CJ$2=1,Klimadaten!CJ30,\"\")","v":""},null,null,null,{"$f":"IF(CN$2=1,Klimadaten!CN30,\"\")","v":""},null,null,null,{"$f":"IF(CR$2=1,Klimadaten!CR30,\"\")","v":""},null,null,null,{"$f":"IF(CV$2=1,Klimadaten!CV30,\"\")","v":""},null,null,null,{"$f":"IF(CZ$2=1,Klimadaten!CZ30,\"\")","v":""},null,null,null,{"$f":"IF(DD$2=1,Klimadaten!DD30,\"\")","v":""},null,null,null,{"$f":"IF(DH$2=1,Klimadaten!DH30,\"\")","v":""},null,null,null,{"$f":"IF(DL$2=1,Klimadaten!DL30,\"\")","v":""},null,null,null,{"$f":"IF(DP$2=1,Klimadaten!DP30,\"\")","v":""},null,null,null,{"$f":"IF(DT$2=1,Klimadaten!DT30,\"\")","v":""},null,null,null,{"$f":"IF(DX$2=1,Klimadaten!DX30,\"\")","v":""},null,null,null,{"$f":"IF(EB$2=1,Klimadaten!EB30,\"\")","v":""},null,null,null,{"$f":"IF(EF$2=1,Klimadaten!EF30,\"\")","v":""},null,null,null,{"$f":"IF(EJ$2=1,Klimadaten!EJ30,\"\")","v":""},null,null,null,{"$f":"IF(EN$2=1,Klimadaten!EN30,\"\")","v":""},null,null,null,{"$f":"IF(ER$2=1,Klimadaten!ER30,\"\")","v":""},null,null,null,{"$f":"IF(EV$2=1,Klimadaten!EV30,\"\")","v":""},null,null,null,{"$f":"IF(EZ$2=1,Klimadaten!EZ30,\"\")","v":""},null,null,null,{"$f":"IF(FD$2=1,Klimadaten!FD30,\"\")","v":""},null,null,null,{"$f":"IF(FH$2=1,Klimadaten!FH30,\"\")","v":""},null,null,null,{"$f":"IF(FL$2=1,Klimadaten!FL30,\"\")","v":""},null,null,null,{"$f":"IF(FP$2=1,Klimadaten!FP30,\"\")","v":""},null,null,null,{"$f":"IF(FT$2=1,Klimadaten!FT30,\"\")","v":""},null,null,null,{"$f":"IF(FX$2=1,Klimadaten!FX30,\"\")","v":""},null,null,null,{"$f":"IF(GB$2=1,Klimadaten!GB30,\"\")","v":""},null,null,null,{"$f":"IF(GF$2=1,Klimadaten!GF30,\"\")","v":""},null,null,null,{"$f":"IF(GJ$2=1,Klimadaten!GJ30,\"\")","v":""},null,null,null,{"$f":"IF(GN$2=1,Klimadaten!GN30,\"\")","v":""},null,null,null,{"$f":"IF(GR$2=1,Klimadaten!GR30,\"\")","v":""},null,null,null,{"$f":"IF(GV$2=1,Klimadaten!GV30,\"\")","v":""},null,null,null,{"$f":"IF(GZ$2=1,Klimadaten!GZ30,\"\")","v":""},null,null,null,{"$f":"IF(HD$2=1,Klimadaten!HD30,\"\")","v":""},null,null,null,{"$f":"IF(HH$2=1,Klimadaten!HH30,\"\")","v":""},null,null,null,{"$f":"IF(HL$2=1,Klimadaten!HL30,\"\")","v":""},null,null,null,{"$f":"IF(HP$2=1,Klimadaten!HP30,\"\")","v":""},null,null,null,{"$f":"IF(HT$2=1,Klimadaten!HT30,\"\")","v":""},null,null,null,{"$f":"IF(HX$2=1,Klimadaten!HX30,\"\")","v":""},null,null,null,{"$f":"IF(IB$2=1,Klimadaten!IB30,\"\")","v":2},null,null,null,{"$f":"IF(IF$2=1,Klimadaten!IF30,\"\")","v":""},null,null,null,{"$f":"IF(IJ$2=1,Klimadaten!IJ30,\"\")","v":""},null,null,null,{"$f":"IF(IN$2=1,Klimadaten!IN30,\"\")","v":""},null,null,null,{"$f":"IF(IR$2=1,Klimadaten!IR30,\"\")","v":""},null,null,null,{"$f":"IF(IV$2=1,Klimadaten!IV30,\"\")","v":""},null,null,null,{"$f":"IF(IZ$2=1,Klimadaten!IZ30,\"\")","v":""},null,null,null,{"$f":"IF(JD$2=1,Klimadaten!JD30,\"\")","v":""},null,null,null,{"$f":"IF(JH$2=1,Klimadaten!JH30,\"\")","v":""},null,null,null,{"$f":"IF(JL$2=1,Klimadaten!JL30,\"\")","v":""}]
[1,null,null,{"$f":"IF(D$2=1,Klimadaten!D31,\"\")","v":14},null,null,null,{"$f":"IF(H$2=1,Klimadaten!H31,\"\")","v":""},null,null,null,{"$f":"IF(L$2=1,Klimadaten!L31,\"\")","v":""},null,null,null,{"$f":"IF(P$2=1,Klimadaten!P31,\"\")","v":16},null,null,null,{"$f":"IF(T$2=1,Klimadaten!T31,\"\")","v":""},null,null,null,{"$f":"IF(X$2=1,Klimadaten!X31,\"\")","v":""},null,null,null,{"$f":"IF(AB$2=1,Klimadaten!AB31,\"\")","v":""},null,null,null,{"$f":"IF(AF$2=1,Klimadaten!AF31,\"\")","v":""},null,null,null,{"$f":"IF(AJ$2=1,Klimadaten!AJ31,\"\")","v":""},null,null,null,{"$f":"IF(AN$2=1,Klimadaten!AN31,\"\")","v":""},null,null,null,{"$f":"IF(AR$2=1,Klimadaten!AR31,\"\")","v":""},null,null,null,{"$f":"IF(AV$2=1,Klimadaten!AV31,\"\")","v":""},null,null,null,{"$f":"IF(AZ$2=1,Klimadaten!AZ31,\"\")","v":""},null,null,null,{"$f":"IF(BD$2=1,Klimadaten!BD31,\"\")","v":""},null,null,null,{"$f":"IF(BH$2=1,Klimadaten!BH31,\"\")","v":""},null,null,null,{"$f":"IF(BL$2=1,Klimadaten!BL31,\"\")","v":""},null,null,null,{"$f":"IF(BP$2=1,Klimadaten!BP31,\"\")","v":""},null,null,null,{"$f":"IF(BT$2=1,Klimadaten!BT31,\"\")","v":13},null,null,null,{"$f":"IF(BX$2=1,Klimadaten!BX31,\"\")","v":""},null,null,null,{"$f":"IF(CB$2=1,Klimadaten!CB31,\"\")","v":""},null,null,null,{"$f":"IF(CF$2=1,Klimadaten!CF31,\"\")","v":""},null,null,null,{"$f":"IF(CJ$2=1,Klimadaten!CJ31,\"\")","v":""},null,null,null,{"$f":"IF(CN$2=1,Klimadaten!CN31,\"\")","v":""},null,null,null,{"$f":"IF(CR$2=1,Klimadaten!CR31,\"\")","v":""},null,null,null,{"$f":"IF(CV$2=1,Klimadaten!CV31,\"\")","v":""},null,null,null,{"$f":"IF(CZ$2=1,Klimadaten!CZ31,\"\")","v":""},null,null,null,{"$f":"IF(DD$2=1,Klimadaten!DD31,\"\")","v":""},null,null,null,{"$f":"IF(DH$2=1,Klimadaten!DH31,\"\")","v":""},null,null,null,{"$f":"IF(DL$2=1,Klimadaten!DL31,\"\")","v":""},null,null,null,{"$f":"IF(DP$2=1,Klimadaten!DP31,\"\")","v":""},null,null,null,{"$f":"IF(DT$2=1,Klimadaten!DT31,\"\")","v":""},null,null,null,{"$f":"IF(DX$2=1,Klimadaten!DX31,\"\")","v":""},null,null,null,{"$f":"IF(EB$2=1,Klimadaten!EB31,\"\")","v":""},null,null,null,{"$f":"IF(EF$2=1,Klimadaten!EF31,\"\")","v":""},null,null,null,{"$f":"IF(EJ$2=1,Klimadaten!EJ31,\"\")","v":""},null,null,null,{"$f":"IF(EN$2=1,Klimadaten!EN31,\"\")","v":""},null,null,null,{"$f":"IF(ER$2=1,Klimadaten!ER31,\"\")","v":""},null,null,null,{"$f":"IF(EV$2=1,Klimadaten!EV31,\"\")","v":""},null,null,null,{"$f":"IF(EZ$2=1,Klimadaten!EZ31,\"\")","v":""},null,null,null,{"$f":"IF(FD$2=1,Klimadaten!FD31,\"\")","v":""},null,null,null,{"$f":"IF(FH$2=1,Klimadaten!FH31,\"\")","v":""},null,null,null,{"$f":"IF(FL$2=1,Klimadaten!FL31,\"\")","v":""},null,null,null,{"$f":"IF(FP$2=1,Klimadaten!FP31,\"\")","v":""},null,null,null,{"$f":"IF(FT$2=1,Klimadaten!FT31,\"\")","v":""},null,null,null,{"$f":"IF(FX$2=1,Klimadaten!FX31,\"\")","v":""},null,null,null,{"$f":"IF(GB$2=1,Klimadaten!GB31,\"\")","v":""},null,null,null,{"$f":"IF(GF$2=1,Klimadaten!GF31,\"\")","v":""},null,null,null,{"$f":"IF(GJ$2=1,Klimadaten!GJ31,\"\")","v":""},null,null,null,{"$f":"IF(GN$2=1,Klimadaten!GN31,\"\")","v":""},null,null,null,{"$f":"IF(GR$2=1,Klimadaten!GR31,\"\")","v":""},null,null,null,{"$f":"IF(GV$2=1,Klimadaten!GV31,\"\")","v":""},null,null,null,{"$f":"IF(GZ$2=1,Klimadaten!GZ31,\"\")","v":""},null,null,null,{"$f":"IF(HD$2=1,Klimadaten!HD31,\"\")","v":""},null,null,null,{"$f":"IF(HH$2=1,Klimadaten!HH31,\"\")","v":""},null,null,null,{"$f":"IF(HL$2=1,Klimadaten!HL31,\"\")","v":""},null,null,null,{"$f":"IF(HP$2=1,Klimadaten!HP31,\"\")","v":""},null,null,null,{"$f":"IF(HT$2=1,Klimadaten!HT31,\"\")","v":""},null,null,null,{"$f":"IF(HX$2=1,Klimadaten!HX31,\"\")","v":""},null,null,null,{"$f":"IF(IB$2=1,Klimadaten!IB31,\"\")","v":6},null,null,null,{"$f":"IF(IF$2=1,Klimadaten!IF31,\"\")","v":""},null,null,null,{"$f":"IF(IJ$2=1,Klimadaten!IJ31,\"\")","v":""},null,null,null,{"$f":"IF(IN$2=1,Klimadaten!IN31,\"\")","v":""},null,null,null,{"$f":"IF(IR$2=1,Klimadaten!IR31,\"\")","v":""},null,null,null,{"$f":"IF(IV$2=1,Klimadaten!IV31,\"\")","v":""},null,null,null,{"$f":"IF(IZ$2=1,Klimadaten!IZ31,\"\")","v":""},null,null,null,{"$f":"IF(JD$2=1,Klimadaten!JD31,\"\")","v":""},null,null,null,{"$f":"IF(JH$2=1,Klimadaten!JH31,\"\")","v":""},null,null,null,{"$f":"IF(JL$2=1,Klimadaten!JL31,\"\")","v":""}]
[2,null,null,{"$f":"IF(D$2=1,Klimadaten!D32,\"\")","v":15},null,null,null,{"$f":"IF(H$2=1,Klimadaten!H32,\"\")","v":""},null,null,null,{"$f":"IF(L$2=1,Klimadaten!L32,\"\")","v":""},null,null,null,{"$f":"IF(P$2=1,Klimadaten!P32,\"\")","v":16},null,null,null,{"$f":"IF(T$2=1,Klimadaten!T32,\"\")","v":""},null,null,null,{"$f":"IF(X$2=1,Klimadaten!X32,\"\")","v":""},null,null,null,{"$f":"IF(AB$2=1,Klimadaten!AB32,\"\")","v":""},null,null,null,{"$f":"IF(AF$2=1,Klimadaten!AF32,\"\")","v":""},null,null,null,{"$f":"IF(AJ$2=1,Klimadaten!AJ32,\"\")","v":""},null,null,null,{"$f":"IF(AN$2=1,Klimadaten!AN32,\"\")","v":""},null,null,null,{"$f":"IF(AR$2=1,Klimadaten!AR32,\"\")","v":""},null,null,null,{"$f":"IF(AV$2=1,Klimadaten!AV32,\"\")","v":""},null,null,null,{"$f":"IF(AZ$2=1,Klimadaten!AZ32,\"\")","v":""},null,null,null,{"$f":"IF(BD$2=1,Klimadaten!BD32,\"\")","v":""},null,null,null,{"$f":"IF(BH$2=1,Klimadaten!BH32,\"\")","v":""},null,null,null,{"$f":"IF(BL$2=1,Klimadaten!BL32,\"\")","v":""},null,null,null,{"$f":"IF(BP$2=1,Klimadaten!BP32,\"\")","v":""},null,null,null,{"$f":"IF(BT$2=1,Klimadaten!BT32,\"\")","v":15},null,null,null,{"$f":"IF(BX$2=1,Klimadaten!BX32,\"\")","v":""},null,null,null,{"$f":"IF(CB$2=1,Klimadaten!CB32,\"\")","v":""},null,null,null,{"$f":"IF(CF$2=1,Klimadaten!CF32,\"\")","v":""},null,null,null,{"$f":"IF(CJ$2=1,Klimadaten!CJ32,\"\")","v":""},null,null,null,{"$f":"IF(CN$2=1,Klimadaten!CN32,\"\")","v":""},null,null,null,{"$f":"IF(CR$2=1,Klimadaten!CR32,\"\")","v":""},null,null,null,{"$f":"IF(CV$2=1,Klimadaten!CV32,\"\")","v":""},null,null,null,{"$f":"IF(CZ$2=1,Klimadaten!CZ32,\"\")","v":""},null,null,null,{"$f":"IF(DD$2=1,Klimadaten!DD32,\"\")","v":""},null,null,null,{"$f":"IF(DH$2=1,Klimadaten!DH32,\"\")","v":""},null,null,null,{"$f":"IF(DL$2=1,Klimadaten!DL32,\"\")","v":""},null,null,null,{"$f":"IF(DP$2=1,Klimadaten!DP32,\"\")","v":""},null,null,null,{"$f":"IF(DT$2=1,Klimadaten!DT32,\"\")","v":""},null,null,null,{"$f":"IF(DX$2=1,Klimadaten!DX32,\"\")","v":""},null,null,null,{"$f":"IF(EB$2=1,Klimadaten!EB32,\"\")","v":""},null,null,null,{"$f":"IF(EF$2=1,Klimadaten!EF32,\"\")","v":""},null,null,null,{"$f":"IF(EJ$2=1,Klimadaten!EJ32,\"\")","v":""},null,null,null,{"$f":"IF(EN$2=1,Klimadaten!EN32,\"\")","v":""},null,null,null,{"$f":"IF(ER$2=1,Klimadaten!ER32,\"\")","v":""},null,null,null,{"$f":"IF(EV$2=1,Klimadaten!EV32,\"\")","v":""},null,null,null,{"$f":"IF(EZ$2=1,Klimadaten!EZ32,\"\")","v":""},null,null,null,{"$f":"IF(FD$2=1,Klimadaten!FD32,\"\")","v":""},null,null,null,{"$f":"IF(FH$2=1,Klimadaten!FH32,\"\")","v":""},null,null,null,{"$f":"IF(FL$2=1,Klimadaten!FL32,\"\")","v":""},null,null,null,{"$f":"IF(FP$2=1,Klimadaten!FP32,\"\")","v":""},null,null,null,{"$f":"IF(FT$2=1,Klimadaten!FT32,\"\")","v":""},null,null,null,{"$f":"IF(FX$2=1,Klimadaten!FX32,\"\")","v":""},null,null,null,{"$f":"IF(GB$2=1,Klimadaten!GB32,\"\")","v":""},null,null,null,{"$f":"IF(GF$2=1,Klimadaten!GF32,\"\")","v":""},null,null,null,{"$f":"IF(GJ$2=1,Klimadaten!GJ32,\"\")","v":""},null,null,null,{"$f":"IF(GN$2=1,Klimadaten!GN32,\"\")","v":""},null,null,null,{"$f":"IF(GR$2=1,Klimadaten!GR32,\"\")","v":""},null,null,null,{"$f":"IF(GV$2=1,Klimadaten!GV32,\"\")","v":""},null,null,null,{"$f":"IF(GZ$2=1,Klimadaten!GZ32,\"\")","v":""},null,null,null,{"$f":"IF(HD$2=1,Klimadaten!HD32,\"\")","v":""},null,null,null,{"$f":"IF(HH$2=1,Klimadaten!HH32,\"\")","v":""},null,null,null,{"$f":"IF(HL$2=1,Klimadaten!HL32,\"\")","v":""},null,null,null,{"$f":"IF(HP$2=1,Klimadaten!HP32,\"\")","v":""},null,null,null,{"$f":"IF(HT$2=1,Klimadaten!HT32,\"\")","v":""},null,null,null,{"$f":"IF(HX$2=1,Klimadaten!HX32,\"\")","v":""},null,null,null,{"$f":"IF(IB$2=1,Klimadaten!IB32,\"\")","v":8},null,null,null,{"$f":"IF(IF$2=1,Klimadaten!IF32,\"\")","v":""},null,null,null,{"$f":"IF(IJ$2=1,Klimadaten!IJ32,\"\")","v":""},null,null,null,{"$f":"IF(IN$2=1,Klimadaten!IN32,\"\")","v":""},null,null,null,{"$f":"IF(IR$2=1,Klimadaten!IR32,\"\")","v":""},null,null,null,{"$f":"IF(IV$2=1,Klimadaten!IV32,\"\")","v":""},null,null,null,{"$f":"IF(IZ$2=1,Klimadaten!IZ32,\"\")","v":""},null,null,null,{"$f":"IF(JD$2=1,Klimadaten!JD32,\"\")","v":""},null,null,null,{"$f":"IF(JH$2=1,Klimadaten!JH32,\"\")","v":""},null,null,null,{"$f":"IF(JL$2=1,Klimadaten!JL32,\"\")","v":""}]
[3,null,null,{"$f":"IF(D$2=1,Klimadaten!D33,\"\")","v":15},null,null,null,{"$f":"IF(H$2=1,Klimadaten!H33,\"\")","v":""},null,null,null,{"$f":"IF(L$2=1,Klimadaten!L33,\"\")","v":""},null,null,null,{"$f":"IF(P$2=1,Klimadaten!P33,\"\")","v":13},null,null,null,{"$f":"IF(T$2=1,Klimadaten!T33,\"\")","v":""},null,null,null,{"$f":"IF(X$2=1,Klimadaten!X33,\"\")","v":""},null,null,null,{"$f":"IF(AB$2=1,Klimadaten!AB33,\"\")","v":""},null,null,null,{"$f":"IF(AF$2=1,Klimadaten!AF33,\"\")","v":""},null,null,null,{"$f":"IF(AJ$2=1,Klimadaten!AJ33,\"\")","v":""},null,null,null,{"$f":"IF(AN$2=1,Klimadaten!AN33,\"\")","v":""},null,null,null,{"$f":"IF(AR$2=1,Klimadaten!AR33,\"\")","v":""},null,null,null,{"$f":"IF(AV$2=1,Klimadaten!AV33,\"\")","v":""},null,null,null,{"$f":"IF(AZ$2=1,Klimadaten!AZ33,\"\")","v":""},null,null,null,{"$f":"IF(BD$2=1,Klimadaten!BD33,\"\")","v":""},null,null,null,{"$f":"IF(BH$2=1,Klimadaten!BH33,\"\")","v":""},null,null,null,{"$f":"IF(BL$2=1,Klimadaten!BL33,\"\")","v":""},null,null,null,{"$f":"IF(BP$2=1,Klimadaten!BP33,\"\")","v":""},null,null,null,{"$f":"IF(BT$2=1,Klimadaten!BT33,\"\")","v":15},null,null,null,{"$f":"IF(BX$2=1,Klimadaten!BX33,\"\")","v":""},null,null,null,{"$f":"IF(CB$2=1,Klimadaten!CB33,\"\")","v":""},null,null,null,{"$f":"IF(CF$2=1,Klimadaten!CF33,\"\")","v":""},null,null,null,{"$f":"IF(CJ$2=1,Klimadaten!CJ33,\"\")","v":""},null,null,null,{"$f":"IF(CN$2=1,Klimadaten!CN33,\"\")","v":""},null,null,null,{"$f":"IF(CR$2=1,Klimadaten!CR33,\"\")","v":""},null,null,null,{"$f":"IF(CV$2=1,Klimadaten!CV33,\"\")","v":""},null,null,null,{"$f":"IF(CZ$2=1,Klimadaten!CZ33,\"\")","v":""},null,null,null,{"$f":"IF(DD$2=1,Klimadaten!DD33,\"\")","v":""},null,null,null,{"$f":"IF(DH$2=1,Klimadaten!DH33,\"\")","v":""},null,null,null,{"$f":"IF(DL$2=1,Klimadaten!DL33,\"\")","v":""},null,null,null,{"$f":"IF(DP$2=1,Klimadaten!DP33,\"\")","v":""},null,null,null,{"$f":"IF(DT$2=1,Klimadaten!DT33,\"\")","v":""},null,null,null,{"$f":"IF(DX$2=1,Klimadaten!DX33,\"\")","v":""},null,null,null,{"$f":"IF(EB$2=1,Klimadaten!EB33,\"\")","v":""},null,null,null,{"$f":"IF(EF$2=1,Klimadaten!EF33,\"\")","v":""},null,null,null,{"$f":"IF(EJ$2=1,Klimadaten!EJ33,\"\")","v":""},null,null,null,{"$f":"IF(EN$2=1,Klimadaten!EN33,\"\")","v":""},null,null,null,{"$f":"IF(ER$2=1,Klimadaten!ER33,\"\")","v":""},null,null,null,{"$f":"IF(EV$2=1,Klimadaten!EV33,\"\")","v":""},null,null,null,{"$f":"IF(EZ$2=1,Klimadaten!EZ33,\"\")","v":""},null,null,null,{"$f":"IF(FD$2=1,Klimadaten!FD33,\"\")","v":""},null,null,null,{"$f":"IF(FH$2=1,Klimadaten!FH33,\"\")","v":""},null,null,null,{"$f":"IF(FL$2=1,Klimadaten!FL33,\"\")","v":""},null,null,null,{"$f":"IF(FP$2=1,Klimadaten!FP33,\"\")","v":""},null,null,null,{"$f":"IF(FT$2=1,Klimadaten!FT33,\"\")","v":""},null,null,null,{"$f":"IF(FX$2=1,Klimadaten!FX33,\"\")","v":""},null,null,null,{"$f":"IF(GB$2=1,Klimadaten!GB33,\"\")","v":""},null,null,null,{"$f":"IF(GF$2=1,Klimadaten!GF33,\"\")","v":""},null,null,null,{"$f":"IF(GJ$2=1,Klimadaten!GJ33,\"\")","v":""},null,null,null,{"$f":"IF(GN$2=1,Klimadaten!GN33,\"\")","v":""},null,null,null,{"$f":"IF(GR$2=1,Klimadaten!GR33,\"\")","v":""},null,null,null,{"$f":"IF(GV$2=1,Klimadaten!GV33,\"\")","v":""},null,null,null,{"$f":"IF(GZ$2=1,Klimadaten!GZ33,\"\")","v":""},null,null,null,{"$f":"IF(HD$2=1,Klimadaten!HD33,\"\")","v":""},null,null,null,{"$f":"IF(HH$2=1,Klimadaten!HH33,\"\")","v":""},null,null,null,{"$f":"IF(HL$2=1,Klimadaten!HL33,\"\")","v":""},null,null,null,{"$f":"IF(HP$2=1,Klimadaten!HP33,\"\")","v":""},null,null,null,{"$f":"IF(HT$2=1,Klimadaten!HT33,\"\")","v":""},null,null,null,{"$f":"IF(HX$2=1,Klimadaten!HX33,\"\")","v":""},null,null,null,{"$f":"IF(IB$2=1,Klimadaten!IB33,\"\")","v":10},null,null,null,{"$f":"IF(IF$2=1,Klimadaten!IF33,\"\")","v":""},null,null,null,{"$f":"IF(IJ$2=1,Klimadaten!IJ33,\"\")","v":""},null,null,null,{"$f":"IF(IN$2=1,Klimadaten!IN33,\"\")","v":""},null,null,null,{"$f":"IF(IR$2=1,Klimadaten!IR33,\"\")","v":""},null,null,null,{"$f":"IF(IV$2=1,Klimadaten!IV33,\"\")","v":""},null,null,null,{"$f":"IF(IZ$2=1,Klimadaten!IZ33,\"\")","v":""},null,null,null,{"$f":"IF(JD$2=1,Klimadaten!JD33,\"\")","v":""},null,null,null,{"$f":"IF(JH$2=1,Klimadaten!JH33,\"\")","v":""},null,null,null,{"$f":"IF(JL$2=1,Klimadaten!JL33,\"\")","v":""}]
[4,null,null,{"$f":"IF(D$2=1,Klimadaten!D34,\"\")","v":17},null,null,null,{"$f":"IF(H$2=1,Klimadaten!H34,\"\")","v":""},null,null,null,{"$f":"IF(L$2=1,Klimadaten!L34,\"\")","v":""},null,null,null,{"$f":"IF(P$2=1,Klimadaten!P34,\"\")","v":11},null,null,null,{"$f":"IF(T$2=1,Klimadaten!T34,\"\")","v":""},null,null,null,{"$f":"IF(X$2=1,Klimadaten!X34,\"\")","v":""},null,null,null,{"$f":"IF(AB$2=1,Klimadaten!AB34,\"\")","v":""},null,null,null,{"$f":"IF(AF$2=1,Klimadaten!AF34,\"\")","v":""},null,null,null,{"$f":"IF(AJ$2=1,Klimadaten!AJ34,\"\")","v":""},null,null,null,{"$f":"IF(AN$2=1,Klimadaten!AN34,\"\")","v":""},null,null,null,{"$f":"IF(AR$2=1,Klimadaten!AR34,\"\")","v":""},null,null,null,{"$f":"IF(AV$2=1,Klimadaten!AV34,\"\")","v":""},null,null,null,{"$f":"IF(AZ$2=1,Klimadaten!AZ34,\"\")","v":""},null,null,null,{"$f":"IF(BD$2=1,Klimadaten!BD34,\"\")","v":""},null,null,null,{"$f":"IF(BH$2=1,Klimadaten!BH34,\"\")","v":""},null,null,null,{"$f":"IF(BL$2=1,Klimadaten!BL34,\"\")","v":""},null,null,null,{"$f":"IF(BP$2=1,Klimadaten!BP34,\"\")","v":""},null,null,null,{"$f":"IF(BT$2=1,Klimadaten!BT34,\"\")","v":14},null,null,null,{"$f":"IF(BX$2=1,Klimadaten!BX34,\"\")","v":""},null,null,null,{"$f":"IF(CB$2=1,Klimadaten!CB34,\"\")","v":""},null,null,null,{"$f":"IF(CF$2=1,Klimadaten!CF34,\"\")","v":""},null,null,null,{"$f":"IF(CJ$2=1,Klimadaten!CJ34,\"\")","v":""},null,null,null,{"$f":"IF(CN$2=1,Klimadaten!CN34,\"\")","v":""},null,null,null,{"$f":"IF(CR$2=1,Klimadaten!CR34,\"\")","v":""},null,null,null,{"$f":"IF(CV$2=1,Klimadaten!CV34,\"\")","v":""},null,null,null,{"$f":"IF(CZ$2=1,Klimadaten!CZ34,\"\")","v":""},null,null,null,{"$f":"IF(DD$2=1,Klimadaten!DD34,\"\")","v":""},null,null,null,{"$f":"IF(DH$2=1,Klimadaten!DH34,\"\")","v":""},null,null,null,{"$f":"IF(DL$2=1,Klimadaten!DL34,\"\")","v":""},null,null,null,{"$f":"IF(DP$2=1,Klimadaten!DP34,\"\")","v":""},null,null,null,{"$f":"IF(DT$2=1,Klimadaten!DT34,\"\")","v":""},null,null,null,{"$f":"IF(DX$2=1,Klimadaten!DX34,\"\")","v":""},null,null,null,{"$f":"IF(EB$2=1,Klimadaten!EB34,\"\")","v":""},null,null,null,{"$f":"IF(EF$2=1,Klimadaten!EF34,\"\")","v":""},null,null,null,{"$f":"IF(EJ$2=1,Klimadaten!EJ34,\"\")","v":""},null,null,null,{"$f":"IF(EN$2=1,Klimadaten!EN34,\"\")","v":""},null,null,null,{"$f":"IF(ER$2=1,Klimadaten!ER34,\"\")","v":""},null,null,null,{"$f":"IF(EV$2=1,Klimadaten!EV34,\"\")","v":""},null,null,null,{"$f":"IF(EZ$2=1,Klimadaten!EZ34,\"\")","v":""},null,null,null,{"$f":"IF(FD$2=1,Klimadaten!FD34,\"\")","v":""},null,null,null,{"$f":"IF(FH$2=1,Klimadaten!FH34,\"\")","v":""},null,null,null,{"$f":"IF(FL$2=1,Klimadaten!FL34,\"\")","v":""},null,null,null,{"$f":"IF(FP$2=1,Klimadaten!FP34,\"\")","v":""},null,null,null,{"$f":"IF(FT$2=1,Klimadaten!FT34,\"\")","v":""},null,null,null,{"$f":"IF(FX$2=1,Klimadaten!FX34,\"\")","v":""},null,null,null,{"$f":"IF(GB$2=1,Klimadaten!GB34,\"\")","v":""},null,null,null,{"$f":"IF(GF$2=1,Klimadaten!GF34,\"\")","v":""},null,null,null,{"$f":"IF(GJ$2=1,Klimadaten!GJ34,\"\")","v":""},null,null,null,{"$f":"IF(GN$2=1,Klimadaten!GN34,\"\")","v":""},null,null,null,{"$f":"IF(GR$2=1,Klimadaten!GR34,\"\")","v":""},null,null,null,{"$f":"IF(GV$2=1,Klimadaten!GV34,\"\")","v":""},null,null,null,{"$f":"IF(GZ$2=1,Klimadaten!GZ34,\"\")","v":""},null,null,null,{"$f":"IF(HD$2=1,Klimadaten!HD34,\"\")","v":""},null,null,null,{"$f":"IF(HH$2=1,Klimadaten!HH34,\"\")","v":""},null,null,null,{"$f":"IF(HL$2=1,Klimadaten!HL34,\"\")","v":""},null,null,null,{"$f":"IF(HP$2=1,Klimadaten!HP34,\"\")","v":""},null,null,null,{"$f":"IF(HT$2=1,Klimadaten!HT34,\"\")","v":""},null,null,null,{"$f":"IF(HX$2=1,Klimadaten!HX34,\"\")","v":""},null,null,null,{"$f":"IF(IB$2=1,Klimadaten!IB34,\"\")","v":15},null,null,null,{"$f":"IF(IF$2=1,Klimadaten!IF34,\"\")","v":""},null,null,null,{"$f":"IF(IJ$2=1,Klimadaten!IJ34,\"\")","v":""},null,null,null,{"$f":"IF(IN$2=1,Klimadaten!IN34,\"\")","v":""},null,null,null,{"$f":"IF(IR$2=1,Klimadaten!IR34,\"\")","v":""},null,null,null,{"$f":"IF(IV$2=1,Klimadaten!IV34,\"\")","v":""},null,null,null,{"$f":"IF(IZ$2=1,Klimadaten!IZ34,\"\")","v":""},null,null,null,{"$f":"IF(JD$2=1,Klimadaten!JD34,\"\")","v":""},null,null,null,{"$f":"IF(JH$2=1,Klimadaten!JH34,\"\")","v":""},null,null,null,{"$f":"IF(JL$2=1,Klimadaten!JL34,\"\")","v":""}]
[5,null,null,{"$f":"IF(D$2=1,Klimadaten!D35,\"\")","v":16},null,null,null,{"$f":"IF(H$2=1,Klimadaten!H35,\"\")","v":""},null,null,null,{"$f":"IF(L$2=1,Klimadaten!L35,\"\")","v":""},null,null,null,{"$f":"IF(P$2=1,Klimadaten!P35,\"\")","v":15},null,null,null,{"$f":"IF(T$2=1,Klimadaten!T35,\"\")","v":""},null,null,null,{"$f":"IF(X$2=1,Klimadaten!X35,\"\")","v":""},null,null,null,{"$f":"IF(AB$2=1,Klimadaten!AB35,\"\")","v":""},null,null,null,{"$f":"IF(AF$2=1,Klimadaten!AF35,\"\")","v":""},null,null,null,{"$f":"IF(AJ$2=1,Klimadaten!AJ35,\"\")","v":""},null,null,null,{"$f":"IF(AN$2=1,Klimadaten!AN35,\"\")","v":""},null,null,null,{"$f":"IF(AR$2=1,Klimadaten!AR35,\"\")","v":""},null,null,null,{"$f":"IF(AV$2=1,Klimadaten!AV35,\"\")","v":""},null,null,null,{"$f":"IF(AZ$2=1,Klimadaten!AZ35,\"\")","v":""},null,null,null,{"$f":"IF(BD$2=1,Klimadaten!BD35,\"\")","v":""},null,null,null,{"$f":"IF(BH$2=1,Klimadaten!BH35,\"\")","v":""},null,null,null,{"$f":"IF(BL$2=1,Klimadaten!BL35,\"\")","v":""},null,null,null,{"$f":"IF(BP$2=1,Klimadaten!BP35,\"\")","v":""},null,null,null,{"$f":"IF(BT$2=1,Klimadaten!BT35,\"\")","v":15},null,null,null,{"$f":"IF(BX$2=1,Klimadaten!BX35,\"\")","v":""},null,null,null,{"$f":"IF(CB$2=1,Klimadaten!CB35,\"\")","v":""},null,null,null,{"$f":"IF(CF$2=1,Klimadaten!CF35,\"\")","v":""},null,null,null,{"$f":"IF(CJ$2=1,Klimadaten!CJ35,\"\")","v":""},null,null,null,{"$f":"IF(CN$2=1,Klimadaten!CN35,\"\")","v":""},null,null,null,{"$f":"IF(CR$2=1,Klimadaten!CR35,\"\")","v":""},null,null,null,{"$f":"IF(CV$2=1,Klimadaten!CV35,\"\")","v":""},null,null,null,{"$f":"IF(CZ$2=1,Klimadaten!CZ35,\"\")","v":""},null,null,null,{"$f":"IF(DD$2=1,Klimadaten!DD35,\"\")","v":""},null,null,null,{"$f":"IF(DH$2=1,Klimadaten!DH35,\"\")","v":""},null,null,null,{"$f":"IF(DL$2=1,Klimadaten!DL35,\"\")","v":""},null,null,null,{"$f":"IF(DP$2=1,Klimadaten!DP35,\"\")","v":""},null,null,null,{"$f":"IF(DT$2=1,Klimadaten!DT35,\"\")","v":""},null,null,null,{"$f":"IF(DX$2=1,Klimadaten!DX35,\"\")","v":""},null,null,null,{"$f":"IF(EB$2=1,Klimadaten!EB35,\"\")","v":""},null,null,null,{"$f":"IF(EF$2=1,Klimadaten!EF35,\"\")","v":""},null,null,null,{"$f":"IF(EJ$2=1,Klimadaten!EJ35,\"\")","v":""},null,null,null,{"$f":"IF(EN$2=1,Klimadaten!EN35,\"\")","v":""},null,null,null,{"$f":"IF(ER$2=1,Klimadaten!ER35,\"\")","v":""},null,null,null,{"$f":"IF(EV$2=1,Klimadaten!EV35,\"\")","v":""},null,null,null,{"$f":"IF(EZ$2=1,Klimadaten!EZ35,\"\")","v":""},null,null,null,{"$f":"IF(FD$2=1,Klimadaten!FD35,\"\")","v":""},null,null,null,{"$f":"IF(FH$2=1,Klimadaten!FH35,\"\")","v":""},null,null,null,{"$f":"IF(FL$2=1,Klimadaten!FL35,\"\")","v":""},null,null,null,{"$f":"IF(FP$2=1,Klimadaten!FP35,\"\")","v":""},null,null,null,{"$f":"IF(FT$2=1,Klimadaten!FT35,\"\")","v":""},null,null,null,{"$f":"IF(FX$2=1,Klimadaten!FX35,\"\")","v":""},null,null,null,{"$f":"IF(GB$2=1,Klimadaten!GB35,\"\")","v":""},null,null,null,{"$f":"IF(GF$2=1,Klimadaten!GF35,\"\")","v":""},null,null,null,{"$f":"IF(GJ$2=1,Klimadaten!GJ35,\"\")","v":""},null,null,null,{"$f":"IF(GN$2=1,Klimadaten!GN35,\"\")","v":""},null,null,null,{"$f":"IF(GR$2=1,Klimadaten!GR35,\"\")","v":""},null,null,null,{"$f":"IF(GV$2=1,Klimadaten!GV35,\"\")","v":""},null,null,null,{"$f":"IF(GZ$2=1,Klimadaten!GZ35,\"\")","v":""},null,null,null,{"$f":"IF(HD$2=1,Klimadaten!HD35,\"\")","v":""},null,null,null,{"$f":"IF(HH$2=1,Klimadaten!HH35,\"\")","v":""},null,null,null,{"$f":"IF(HL$2=1,Klimadaten!HL35,\"\")","v":""},null,null,null,{"$f":"IF(HP$2=1,Klimadaten!HP35,\"\")","v":""},null,null,null,{"$f":"IF(HT$2=1,Klimadaten!HT35,\"\")","v":""},null,null,null,{"$f":"IF(HX$2=1,Klimadaten!HX35,\"\")","v":""},null,null,null,{"$f":"IF(IB$2=1,Klimadaten!IB35,\"\")","v":17},null,null,null,{"$f":"IF(IF$2=1,Klimadaten!IF35,\"\")","v":""},null,null,null,{"$f":"IF(IJ$2=1,Klimadaten!IJ35,\"\")","v":""},null,null,null,{"$f":"IF(IN$2=1,Klimadaten!IN35,\"\")","v":""},null,null,null,{"$f":"IF(IR$2=1,Klimadaten!IR35,\"\")","v":""},null,null,null,{"$f":"IF(IV$2=1,Klimadaten!IV35,\"\")","v":""},null,null,null,{"$f":"IF(IZ$2=1,Klimadaten!IZ35,\"\")","v":""},null,null,null,{"$f":"IF(JD$2=1,Klimadaten!JD35,\"\")","v":""},null,null,null,{"$f":"IF(JH$2=1,Klimadaten!JH35,\"\")","v":""},null,null,null,{"$f":"IF(JL$2=1,Klimadaten!JL35,\"\")","v":""}]
[6,null,null,{"$f":"IF(D$2=1,Klimadaten!D36,\"\")","v":15},null,null,null,{"$f":"IF(H$2=1,Klimadaten!H36,\"\")","v":""},null,null,null,{"$f":"IF(L$2=1,Klimadaten!L36,\"\")","v":""},null,null,null,{"$f":"IF(P$2=1,Klimadaten!P36,\"\")","v":12},null,null,null,{"$f":"IF(T$2=1,Klimadaten!T36,\"\")","v":""},null,null,null,{"$f":"IF(X$2=1,Klimadaten!X36,\"\")","v":""},null,null,null,{"$f":"IF(AB$2=1,Klimadaten!AB36,\"\")","v":""},null,null,null,{"$f":"IF(AF$2=1,Klimadaten!AF36,\"\")","v":""},null,null,null,{"$f":"IF(AJ$2=1,Klimadaten!AJ36,\"\")","v":""},null,null,null,{"$f":"IF(AN$2=1,Klimadaten!AN36,\"\")","v":""},null,null,null,{"$f":"IF(AR$2=1,Klimadaten!AR36,\"\")","v":""},null,null,null,{"$f":"IF(AV$2=1,Klimadaten!AV36,\"\")","v":""},null,null,null,{"$f":"IF(AZ$2=1,Klimadaten!AZ36,\"\")","v":""},null,null,null,{"$f":"IF(BD$2=1,Klimadaten!BD36,\"\")","v":""},null,null,null,{"$f":"IF(BH$2=1,Klimadaten!BH36,\"\")","v":""},null,null,null,{"$f":"IF(BL$2=1,Klimadaten!BL36,\"\")","v":""},null,null,null,{"$f":"IF(BP$2=1,Klimadaten!BP36,\"\")","v":""},null,null,null,{"$f":"IF(BT$2=1,Klimadaten!BT36,\"\")","v":12},null,null,null,{"$f":"IF(BX$2=1,Klimadaten!BX36,\"\")","v":""},null,null,null,{"$f":"IF(CB$2=1,Klimadaten!CB36,\"\")","v":""},null,null,null,{"$f":"IF(CF$2=1,Klimadaten!CF36,\"\")","v":""},null,null,null,{"$f":"IF(CJ$2=1,Klimadaten!CJ36,\"\")","v":""},null,null,null,{"$f":"IF(CN$2=1,Klimadaten!CN36,\"\")","v":""},null,null,null,{"$f":"IF(CR$2=1,Klimadaten!CR36,\"\")","v":""},null,null,null,{"$f":"IF(CV$2=1,Klimadaten!CV36,\"\")","v":""},null,null,null,{"$f":"IF(CZ$2=1,Klimadaten!CZ36,\"\")","v":""},null,null,null,{"$f":"IF(DD$2=1,Klimadaten!DD36,\"\")","v":""},null,null,null,{"$f":"IF(DH$2=1,Klimadaten!DH36,\"\")","v":""},null,null,null,{"$f":"IF(DL$2=1,Klimadaten!DL36,\"\")","v":""},null,null,null,{"$f":"IF(DP$2=1,Klimadaten!DP36,\"\")","v":""},null,null,null,{"$f":"IF(DT$2=1,Klimadaten!DT36,\"\")","v":""},null,null,null,{"$f":"IF(DX$2=1,Klimadaten!DX36,\"\")","v":""},null,null,null,{"$f":"IF(EB$2=1,Klimadaten!EB36,\"\")","v":""},null,null,null,{"$f":"IF(EF$2=1,Klimadaten!EF36,\"\")","v":""},null,null,null,{"$f":"IF(EJ$2=1,Klimadaten!EJ36,\"\")","v":""},null,null,null,{"$f":"IF(EN$2=1,Klimadaten!EN36,\"\")","v":""},null,null,null,{"$f":"IF(ER$2=1,Klimadaten!ER36,\"\")","v":""},null,null,null,{"$f":"IF(EV$2=1,Klimadaten!EV36,\"\")","v":""},null,null,null,{"$f":"IF(EZ$2=1,Klimadaten!EZ36,\"\")","v":""},null,null,null,{"$f":"IF(FD$2=1,Klimadaten!FD36,\"\")","v":""},null,null,null,{"$f":"IF(FH$2=1,Klimadaten!FH36,\"\")","v":""},null,null,null,{"$f":"IF(FL$2=1,Klimadaten!FL36,\"\")","v":""},null,null,null,{"$f":"IF(FP$2=1,Klimadaten!FP36,\"\")","v":""},null,null,null,{"$f":"IF(FT$2=1,Klimadaten!FT36,\"\")","v":""},null,null,null,{"$f":"IF(FX$2=1,Klimadaten!FX36,\"\")","v":""},null,null,null,{"$f":"IF(GB$2=1,Klimadaten!GB36,\"\")","v":""},null,null,null,{"$f":"IF(GF$2=1,Klimadaten!GF36,\"\")","v":""},null,null,null,{"$f":"IF(GJ$2=1,Klimadaten!GJ36,\"\")","v":""},null,null,null,{"$f":"IF(GN$2=1,Klimadaten!GN36,\"\")","v":""},null,null,null,{"$f":"IF(GR$2=1,Klimadaten!GR36,\"\")","v":""},null,null,null,{"$f":"IF(GV$2=1,Klimadaten!GV36,\"\")","v":""},null,null,null,{"$f":"IF(GZ$2=1,Klimadaten!GZ36,\"\")","v":""},null,null,null,{"$f":"IF(HD$2=1,Klimadaten!HD36,\"\")","v":""},null,null,null,{"$f":"IF(HH$2=1,Klimadaten!HH36,\"\")","v":""},null,null,null,{"$f":"IF(HL$2=1,Klimadaten!HL36,\"\")","v":""},null,null,null,{"$f":"IF(HP$2=1,Klimadaten!HP36,\"\")","v":""},null,null,null,{"$f":"IF(HT$2=1,Klimadaten!HT36,\"\")","v":""},null,null,null,{"$f":"IF(HX$2=1,Klimadaten!HX36,\"\")","v":""},null,null,null,{"$f":"IF(IB$2=1,Klimadaten!IB36,\"\")","v":17},null,null,null,{"$f":"IF(IF$2=1,Klimadaten!IF36,\"\")","v":""},null,null,null,{"$f":"IF(IJ$2=1,Klimadaten!IJ36,\"\")","v":""},null,null,null,{"$f":"IF(IN$2=1,Klimadaten!IN36,\"\")","v":""},null,null,null,{"$f":"IF(IR$2=1,Klimadaten!IR36,\"\")","v":""},null,null,null,{"$f":"IF(IV$2=1,Klimadaten!IV36,\"\")","v":""},null,null,null,{"$f":"IF(IZ$2=1,Klimadaten!IZ36,\"\")","v":""},null,null,null,{"$f":"IF(JD$2=1,Klimadaten!JD36,\"\")","v":""},null,null,null,{"$f":"IF(JH$2=1,Klimadaten!JH36,\"\")","v":""},null,null,null,{"$f":"IF(JL$2=1,Klimadaten!JL36,\"\")","v":""}]
[7,null,null,{"$f":"IF(D$2=1,Klimadaten!D37,\"\")","v":14},null,null,null,{"$f":"IF(H$2=1,Klimadaten!H37,\"\")","v":""},null,null,null,{"$f":"IF(L$2=1,Klimadaten!L37,\"\")","v":""},null,null,null,{"$f":"IF(P$2=1,Klimadaten!P37,\"\")","v":11},null,null,null,{"$f":"IF(T$2=1,Klimadaten!T37,\"\")","v":""},null,null,null,{"$f":"IF(X$2=1,Klimadaten!X37,\"\")","v":""},null,null,null,{"$f":"IF(AB$2=1,Klimadaten!AB37,\"\")","v":""},null,null,null,{"$f":"IF(AF$2=1,Klimadaten!AF37,\"\")","v":""},null,null,null,{"$f":"IF(AJ$2=1,Klimadaten!AJ37,\"\")","v":""},null,null,null,{"$f":"IF(AN$2=1,Klimadaten!AN37,\"\")","v":""},null,null,null,{"$f":"IF(AR$2=1,Klimadaten!AR37,\"\")","v":""},null,null,null,{"$f":"IF(AV$2=1,Klimadaten!AV37,\"\")","v":""},null,null,null,{"$f":"IF(AZ$2=1,Klimadaten!AZ37,\"\")","v":""},null,null,null,{"$f":"IF(BD$2=1,Klimadaten!BD37,\"\")","v":""},null,null,null,{"$f":"IF(BH$2=1,Klimadaten!BH37,\"\")","v":""},null,null,null,{"$f":"IF(BL$2=1,Klimadaten!BL37,\"\")","v":""},null,null,null,{"$f":"IF(BP$2=1,Klimadaten!BP37,\"\")","v":""},null,null,null,{"$f":"IF(BT$2=1,Klimadaten!BT37,\"\")","v":13},null,null,null,{"$f":"IF(BX$2=1,Klimadaten!BX37,\"\")","v":""},null,null,null,{"$f":"IF(CB$2=1,Klimadaten!CB37,\"\")","v":""},null,null,null,{"$f":"IF(CF$2=1,Klimadaten!CF37,\"\")","v":""},null,null,null,{"$f":"IF(CJ$2=1,Klimadaten!CJ37,\"\")","v":""},null,null,null,{"$f":"IF(CN$2=1,Klimadaten!CN37,\"\")","v":""},null,null,null,{"$f":"IF(CR$2=1,Klimadaten!CR37,\"\")","v":""},null,null,null,{"$f":"IF(CV$2=1,Klimadaten!CV37,\"\")","v":""},null,null,null,{"$f":"IF(CZ$2=1,Klimadaten!CZ37,\"\")","v":""},null,null,null,{"$f":"IF(DD$2=1,Klimadaten!DD37,\"\")","v":""},null,null,null,{"$f":"IF(DH$2=1,Klimadaten!DH37,\"\")","v":""},null,null,null,{"$f":"IF(DL$2=1,Klimadaten!DL37,\"\")","v":""},null,null,null,{"$f":"IF(DP$2=1,Klimadaten!DP37,\"\")","v":""},null,null,null,{"$f":"IF(DT$2=1,Klimadaten!DT37,\"\")","v":""},null,null,null,{"$f":"IF(DX$2=1,Klimadaten!DX37,\"\")","v":""},null,null,null,{"$f":"IF(EB$2=1,Klimadaten!EB37,\"\")","v":""},null,null,null,{"$f":"IF(EF$2=1,Klimadaten!EF37,\"\")","v":""},null,null,null,{"$f":"IF(EJ$2=1,Klimadaten!EJ37,\"\")","v":""},null,null,null,{"$f":"IF(EN$2=1,Klimadaten!EN37,\"\")","v":""},null,null,null,{"$f":"IF(ER$2=1,Klimadaten!ER37,\"\")","v":""},null,null,null,{"$f":"IF(EV$2=1,Klimadaten!EV37,\"\")","v":""},null,null,null,{"$f":"IF(EZ$2=1,Klimadaten!EZ37,\"\")","v":""},null,null,null,{"$f":"IF(FD$2=1,Klimadaten!FD37,\"\")","v":""},null,null,null,{"$f":"IF(FH$2=1,Klimadaten!FH37,\"\")","v":""},null,null,null,{"$f":"IF(FL$2=1,Klimadaten!FL37,\"\")","v":""},null,null,null,{"$f":"IF(FP$2=1,Klimadaten!FP37,\"\")","v":""},null,null,null,{"$f":"IF(FT$2=1,Klimadaten!FT37,\"\")","v":""},null,null,null,{"$f":"IF(FX$2=1,Klimadaten!FX37,\"\")","v":""},null,null,null,{"$f":"IF(GB$2=1,Klimadaten!GB37,\"\")","v":""},null,null,null,{"$f":"IF(GF$2=1,Klimadaten!GF37,\"\")","v":""},null,null,null,{"$f":"IF(GJ$2=1,Klimadaten!GJ37,\"\")","v":""},null,null,null,{"$f":"IF(GN$2=1,Klimadaten!GN37,\"\")","v":""},null,null,null,{"$f":"IF(GR$2=1,Klimadaten!GR37,\"\")","v":""},null,null,null,{"$f":"IF(GV$2=1,Klimadaten!GV37,\"\")","v":""},null,null,null,{"$f":"IF(GZ$2=1,Klimadaten!GZ37,\"\")","v":""},null,null,null,{"$f":"IF(HD$2=1,Klimadaten!HD37,\"\")","v":""},null,null,null,{"$f":"IF(HH$2=1,Klimadaten!HH37,\"\")","v":""},null,null,null,{"$f":"IF(HL$2=1,Klimadaten!HL37,\"\")","v":""},null,null,null,{"$f":"IF(HP$2=1,Klimadaten!HP37,\"\")","v":""},null,null,null,{"$f":"IF(HT$2=1,Klimadaten!HT37,\"\")","v":""},null,null,null,{"$f":"IF(HX$2=1,Klimadaten!HX37,\"\")","v":""},null,null,null,{"$f":"IF(IB$2=1,Klimadaten!IB37,\"\")","v":17},null,null,null,{"$f":"IF(IF$2=1,Klimadaten!IF37,\"\")","v":""},null,null,null,{"$f":"IF(IJ$2=1,Klimadaten!IJ37,\"\")","v":""},null,null,null,{"$f":"IF(IN$2=1,Klimadaten!IN37,\"\")","v":""},null,null,null,{"$f":"IF(IR$2=1,Klimadaten!IR37,\"\")","v":""},null,null,null,{"$f":"IF(IV$2=1,Klimadaten!IV37,\"\")","v":""},null,null,null,{"$f":"IF(IZ$2=1,Klimadaten!IZ37,\"\")","v":""},null,null,null,{"$f":"IF(JD$2=1,Klimadaten!JD37,\"\")","v":""},null,null,null,{"$f":"IF(JH$2=1,Klimadaten!JH37,\"\")","v":""},null,null,null,{"$f":"IF(JL$2=1,Klimadaten!JL37,\"\")","v":""}]
[8,null,null,{"$f":"IF(D$2=1,Klimadaten!D38,\"\")","v":15},null,null,null,{"$f":"IF(H$2=1,Klimadaten!H38,\"\")","v":""},null,null,null,{"$f":"IF(L$2=1,Klimadaten!L38,\"\")","v":""},null,null,null,{"$f":"IF(P$2=1,Klimadaten!P38,\"\")","v":12},null,null,null,{"$f":"IF(T$2=1,Klimadaten!T38,\"\")","v":""},null,null,null,{"$f":"IF(X$2=1,Klimadaten!X38,\"\")","v":""},null,null,null,{"$f":"IF(AB$2=1,Klimadaten!AB38,\"\")","v":""},null,null,null,{"$f":"IF(AF$2=1,Klimadaten!AF38,\"\")","v":""},null,null,null,{"$f":"IF(AJ$2=1,Klimadaten!AJ38,\"\")","v":""},null,null,null,{"$f":"IF(AN$2=1,Klimadaten!AN38,\"\")","v":""},null,null,null,{"$f":"IF(AR$2=1,Klimadaten!AR38,\"\")","v":""},null,null,null,{"$f":"IF(AV$2=1,Klimadaten!AV38,\"\")","v":""},null,null,null,{"$f":"IF(AZ$2=1,Klimadaten!AZ38,\"\")","v":""},null,null,null,{"$f":"IF(BD$2=1,Klimadaten!BD38,\"\")","v":""},null,null,null,{"$f":"IF(BH$2=1,Klimadaten!BH38,\"\")","v":""},null,null,null,{"$f":"IF(BL$2=1,Klimadaten!BL38,\"\")","v":""},null,null,null,{"$f":"IF(BP$2=1,Klimadaten!BP38,\"\")","v":""},null,null,null,{"$f":"IF(BT$2=1,Klimadaten!BT38,\"\")","v":15},null,null,null,{"$f":"IF(BX$2=1,Klimadaten!BX38,\"\")","v":""},null,null,null,{"$f":"IF(CB$2=1,Klimadaten!CB38,\"\")","v":""},null,null,null,{"$f":"IF(CF$2=1,Klimadaten!CF38,\"\")","v":""},null,null,null,{"$f":"IF(CJ$2=1,Klimadaten!CJ38,\"\")","v":""},null,null,null,{"$f":"IF(CN$2=1,Klimadaten!CN38,\"\")","v":""},null,null,null,{"$f":"IF(CR$2=1,Klimadaten!CR38,\"\")","v":""},null,null,null,{"$f":"IF(CV$2=1,Klimadaten!CV38,\"\")","v":""},null,null,null,{"$f":"IF(CZ$2=1,Klimadaten!CZ38,\"\")","v":""},null,null,null,{"$f":"IF(DD$2=1,Klimadaten!DD38,\"\")","v":""},null,null,null,{"$f":"IF(DH$2=1,Klimadaten!DH38,\"\")","v":""},null,null,null,{"$f":"IF(DL$2=1,Klimadaten!DL38,\"\")","v":""},null,null,null,{"$f":"IF(DP$2=1,Klimadaten!DP38,\"\")","v":""},null,null,null,{"$f":"IF(DT$2=1,Klimadaten!DT38,\"\")","v":""},null,null,null,{"$f":"IF(DX$2=1,Klimadaten!DX38,\"\")","v":""},null,null,null,{"$f":"IF(EB$2=1,Klimadaten!EB38,\"\")","v":""},null,null,null,{"$f":"IF(EF$2=1,Klimadaten!EF38,\"\")","v":""},null,null,null,{"$f":"IF(EJ$2=1,Klimadaten!EJ38,\"\")","v":""},null,null,null,{"$f":"IF(EN$2=1,Klimadaten!EN38,\"\")","v":""},null,null,null,{"$f":"IF(ER$2=1,Klimadaten!ER38,\"\")","v":""},null,null,null,{"$f":"IF(EV$2=1,Klimadaten!EV38,\"\")","v":""},null,null,null,{"$f":"IF(EZ$2=1,Klimadaten!EZ38,\"\")","v":""},null,null,null,{"$f":"IF(FD$2=1,Klimadaten!FD38,\"\")","v":""},null,null,null,{"$f":"IF(FH$2=1,Klimadaten!FH38,\"\")","v":""},null,null,null,{"$f":"IF(FL$2=1,Klimadaten!FL38,\"\")","v":""},null,null,null,{"$f":"IF(FP$2=1,Klimadaten!FP38,\"\")","v":""},null,null,null,{"$f":"IF(FT$2=1,Klimadaten!FT38,\"\")","v":""},null,null,null,{"$f":"IF(FX$2=1,Klimadaten!FX38,\"\")","v":""},null,null,null,{"$f":"IF(GB$2=1,Klimadaten!GB38,\"\")","v":""},null,null,null,{"$f":"IF(GF$2=1,Klimadaten!GF38,\"\")","v":""},null,null,null,{"$f":"IF(GJ$2=1,Klimadaten!GJ38,\"\")","v":""},null,null,null,{"$f":"IF(GN$2=1,Klimadaten!GN38,\"\")","v":""},null,null,null,{"$f":"IF(GR$2=1,Klimadaten!GR38,\"\")","v":""},null,null,null,{"$f":"IF(GV$2=1,Klimadaten!GV38,\"\")","v":""},null,null,null,{"$f":"IF(GZ$2=1,Klimadaten!GZ38,\"\")","v":""},null,null,null,{"$f":"IF(HD$2=1,Klimadaten!HD38,\"\")","v":""},null,null,null,{"$f":"IF(HH$2=1,Klimadaten!HH38,\"\")","v":""},null,null,null,{"$f":"IF(HL$2=1,Klimadaten!HL38,\"\")","v":""},null,null,null,{"$f":"IF(HP$2=1,Klimadaten!HP38,\"\")","v":""},null,null,null,{"$f":"IF(HT$2=1,Klimadaten!HT38,\"\")","v":""},null,null,null,{"$f":"IF(HX$2=1,Klimadaten!HX38,\"\")","v":""},null,null,null,{"$f":"IF(IB$2=1,Klimadaten!IB38,\"\")","v":16},null,null,null,{"$f":"IF(IF$2=1,Klimadaten!IF38,\"\")","v":""},null,null,null,{"$f":"IF(IJ$2=1,Klimadaten!IJ38,\"\")","v":""},null,null,null,{"$f":"IF(IN$2=1,Klimadaten!IN38,\"\")","v":""},null,null,null,{"$f":"IF(IR$2=1,Klimadaten!IR38,\"\")","v":""},null,null,null,{"$f":"IF(IV$2=1,Klimadaten!IV38,\"\")","v":""},null,null,null,{"$f":"IF(IZ$2=1,Klimadaten!IZ38,\"\")","v":""},null,null,null,{"$f":"IF(JD$2=1,Klimadaten!JD38,\"\")","v":""},null,null,null,{"$f":"IF(JH$2=1,Klimadaten!JH38,\"\")","v":""},null,null,null,{"$f":"IF(JL$2=1,Klimadaten!JL38,\"\")","v":""}]
[9,null,null,{"$f":"IF(D$2=1,Klimadaten!D39,\"\")","v":17},null,null,null,{"$f":"IF(H$2=1,Klimadaten!H39,\"\")","v":""},null,null,null,{"$f":"IF(L$2=1,Klimadaten!L39,\"\")","v":""},null,null,null,{"$f":"IF(P$2=1,Klimadaten!P39,\"\")","v":10},null,null,null,{"$f":"IF(T$2=1,Klimadaten!T39,\"\")","v":""},null,null,null,{"$f":"IF(X$2=1,Klimadaten!X39,\"\")","v":""},null,null,null,{"$f":"IF(AB$2=1,Klimadaten!AB39,\"\")","v":""},null,null,null,{"$f":"IF(AF$2=1,Klimadaten!AF39,\"\")","v":""},null,null,null,{"$f":"IF(AJ$2=1,Klimadaten!AJ39,\"\")","v":""},null,null,null,{"$f":"IF(AN$2=1,Klimadaten!AN39,\"\")","v":""},null,null,null,{"$f":"IF(AR$2=1,Klimadaten!AR39,\"\")","v":""},null,null,null,{"$f":"IF(AV$2=1,Klimadaten!AV39,\"\")","v":""},null,null,null,{"$f":"IF(AZ$2=1,Klimadaten!AZ39,\"\")","v":""},null,null,null,{"$f":"IF(BD$2=1,Klimadaten!BD39,\"\")","v":""},null,null,null,{"$f":"IF(BH$2=1,Klimadaten!BH39,\"\")","v":""},null,null,null,{"$f":"IF(BL$2=1,Klimadaten!BL39,\"\")","v":""},null,null,null,{"$f":"IF(BP$2=1,Klimadaten!BP39,\"\")","v":""},null,null,null,{"$f":"IF(BT$2=1,Klimadaten!BT39,\"\")","v":14},null,null,null,{"$f":"IF(BX$2=1,Klimadaten!BX39,\"\")","v":""},null,null,null,{"$f":"IF(CB$2=1,Klimadaten!CB39,\"\")","v":""},null,null,null,{"$f":"IF(CF$2=1,Klimadaten!CF39,\"\")","v":""},null,null,null,{"$f":"IF(CJ$2=1,Klimadaten!CJ39,\"\")","v":""},null,null,null,{"$f":"IF(CN$2=1,Klimadaten!CN39,\"\")","v":""},null,null,null,{"$f":"IF(CR$2=1,Klimadaten!CR39,\"\")","v":""},null,null,null,{"$f":"IF(CV$2=1,Klimadaten!CV39,\"\")","v":""},null,null,null,{"$f":"IF(CZ$2=1,Klimadaten!CZ39,\"\")","v":""},null,null,null,{"$f":"IF(DD$2=1,Klimadaten!DD39,\"\")","v":""},null,null,null,{"$f":"IF(DH$2=1,Klimadaten!DH39,\"\")","v":""},null,null,null,{"$f":"IF(DL$2=1,Klimadaten!DL39,\"\")","v":""},null,null,null,{"$f":"IF(DP$2=1,Klimadaten!DP39,\"\")","v":""},null,null,null,{"$f":"IF(DT$2=1,Klimadaten!DT39,\"\")","v":""},null,null,null,{"$f":"IF(DX$2=1,Klimadaten!DX39,\"\")","v":""},null,null,null,{"$f":"IF(EB$2=1,Klimadaten!EB39,\"\")","v":""},null,null,null,{"$f":"IF(EF$2=1,Klimadaten!EF39,\"\")","v":""},null,null,null,{"$f":"IF(EJ$2=1,Klimadaten!EJ39,\"\")","v":""},null,null,null,{"$f":"IF(EN$2=1,Klimadaten!EN39,\"\")","v":""},null,null,null,{"$f":"IF(ER$2=1,Klimadaten!ER39,\"\")","v":""},null,null,null,{"$f":"IF(EV$2=1,Klimadaten!EV39,\"\")","v":""},null,null,null,{"$f":"IF(EZ$2=1,Klimadaten!EZ39,\"\")","v":""},null,null,null,{"$f":"IF(FD$2=1,Klimadaten!FD39,\"\")","v":""},null,null,null,{"$f":"IF(FH$2=1,Klimadaten!FH39,\"\")","v":""},null,null,null,{"$f":"IF(FL$2=1,Klimadaten!FL39,\"\")","v":""},null,null,null,{"$f":"IF(FP$2=1,Klimadaten!FP39,\"\")","v":""},null,null,null,{"$f":"IF(FT$2=1,Klimadaten!FT39,\"\")","v":""},null,null,null,{"$f":"IF(FX$2=1,Klimadaten!FX39,\"\")","v":""},null,null,null,{"$f":"IF(GB$2=1,Klimadaten!GB39,\"\")","v":""},null,null,null,{"$f":"IF(GF$2=1,Klimadaten!GF39,\"\")","v":""},null,null,null,{"$f":"IF(GJ$2=1,Klimadaten!GJ39,\"\")","v":""},null,null,null,{"$f":"IF(GN$2=1,Klimadaten!GN39,\"\")","v":""},null,null,null,{"$f":"IF(GR$2=1,Klimadaten!GR39,\"\")","v":""},null,null,null,{"$f":"IF(GV$2=1,Klimadaten!GV39,\"\")","v":""},null,null,null,{"$f":"IF(GZ$2=1,Klimadaten!GZ39,\"\")","v":""},null,null,null,{"$f":"IF(HD$2=1,Klimadaten!HD39,\"\")","v":""},null,null,null,{"$f":"IF(HH$2=1,Klimadaten!HH39,\"\")","v":""},null,null,null,{"$f":"IF(HL$2=1,Klimadaten!HL39,\"\")","v":""},null,null,null,{"$f":"IF(HP$2=1,Klimadaten!HP39,\"\")","v":""},null,null,null,{"$f":"IF(HT$2=1,Klimadaten!HT39,\"\")","v":""},null,null,null,{"$f":"IF(HX$2=1,Klimadaten!HX39,\"\")","v":""},null,null,null,{"$f":"IF(IB$2=1,Klimadaten!IB39,\"\")","v":14},null,null,null,{"$f":"IF(IF$2=1,Klimadaten!IF39,\"\")","v":""},null,null,null,{"$f":"IF(IJ$2=1,Klimadaten!IJ39,\"\")","v":""},null,null,null,{"$f":"IF(IN$2=1,Klimadaten!IN39,\"\")","v":""},null,null,null,{"$f":"IF(IR$2=1,Klimadaten!IR39,\"\")","v":""},null,null,null,{"$f":"IF(IV$2=1,Klimadaten!IV39,\"\")","v":""},null,null,null,{"$f":"IF(IZ$2=1,Klimadaten!IZ39,\"\")","v":""},null,null,null,{"$f":"IF(JD$2=1,Klimadaten!JD39,\"\")","v":""},null,null,null,{"$f":"IF(JH$2=1,Klimadaten!JH39,\"\")","v":""},null,null,null,{"$f":"IF(JL$2=1,Klimadaten!JL39,\"\")","v":""}]
[10,null,null,{"$f":"IF(D$2=1,Klimadaten!D40,\"\")","v":17},null,null,null,{"$f":"IF(H$2=1,Klimadaten!H40,\"\")","v":""},null,null,null,{"$f":"IF(L$2=1,Klimadaten!L40,\"\")","v":""},null,null,null,{"$f":"IF(P$2=1,Klimadaten!P40,\"\")","v":11},null,null,null,{"$f":"IF(T$2=1,Klimadaten!T40,\"\")","v":""},null,null,null,{"$f":"IF(X$2=1,Klimadaten!X40,\"\")","v":""},null,null,null,{"$f":"IF(AB$2=1,Klimadaten!AB40,\"\")","v":""},null,null,null,{"$f":"IF(AF$2=1,Klimadaten!AF40,\"\")","v":""},null,null,null,{"$f":"IF(AJ$2=1,Klimadaten!AJ40,\"\")","v":""},null,null,null,{"$f":"IF(AN$2=1,Klimadaten!AN40,\"\")","v":""},null,null,null,{"$f":"IF(AR$2=1,Klimadaten!AR40,\"\")","v":""},null,null,null,{"$f":"IF(AV$2=1,Klimadaten!AV40,\"\")","v":""},null,null,null,{"$f":"IF(AZ$2=1,Klimadaten!AZ40,\"\")","v":""},null,null,null,{"$f":"IF(BD$2=1,Klimadaten!BD40,\"\")","v":""},null,null,null,{"$f":"IF(BH$2=1,Klimadaten!BH40,\"\")","v":""},null,null,null,{"$f":"IF(BL$2=1,Klimadaten!BL40,\"\")","v":""},null,null,null,{"$f":"IF(BP$2=1,Klimadaten!BP40,\"\")","v":""},null,null,null,{"$f":"IF(BT$2=1,Klimadaten!BT40,\"\")","v":17},null,null,null,{"$f":"IF(BX$2=1,Klimadaten!BX40,\"\")","v":""},null,null,null,{"$f":"IF(CB$2=1,Klimadaten!CB40,\"\")","v":""},null,null,null,{"$f":"IF(CF$2=1,Klimadaten!CF40,\"\")","v":""},null,null,null,{"$f":"IF(CJ$2=1,Klimadaten!CJ40,\"\")","v":""},null,null,null,{"$f":"IF(CN$2=1,Klimadaten!CN40,\"\")","v":""},null,null,null,{"$f":"IF(CR$2=1,Klimadaten!CR40,\"\")","v":""},null,null,null,{"$f":"IF(CV$2=1,Klimadaten!CV40,\"\")","v":""},null,null,null,{"$f":"IF(CZ$2=1,Klimadaten!CZ40,\"\")","v":""},null,null,null,{"$f":"IF(DD$2=1,Klimadaten!DD40,\"\")","v":""},null,null,null,{"$f":"IF(DH$2=1,Klimadaten!DH40,\"\")","v":""},null,null,null,{"$f":"IF(DL$2=1,Klimadaten!DL40,\"\")","v":""},null,null,null,{"$f":"IF(DP$2=1,Klimadaten!DP40,\"\")","v":""},null,null,null,{"$f":"IF(DT$2=1,Klimadaten!DT40,\"\")","v":""},null,null,null,{"$f":"IF(DX$2=1,Klimadaten!DX40,\"\")","v":""},null,null,null,{"$f":"IF(EB$2=1,Klimadaten!EB40,\"\")","v":""},null,null,null,{"$f":"IF(EF$2=1,Klimadaten!EF40,\"\")","v":""},null,null,null,{"$f":"IF(EJ$2=1,Klimadaten!EJ40,\"\")","v":""},null,null,null,{"$f":"IF(EN$2=1,Klimadaten!EN40,\"\")","v":""},null,null,null,{"$f":"IF(ER$2=1,Klimadaten!ER40,\"\")","v":""},null,null,null,{"$f":"IF(EV$2=1,Klimadaten!EV40,\"\")","v":""},null,null,null,{"$f":"IF(EZ$2=1,Klimadaten!EZ40,\"\")","v":""},null,null,null,{"$f":"IF(FD$2=1,Klimadaten!FD40,\"\")","v":""},null,null,null,{"$f":"IF(FH$2=1,Klimadaten!FH40,\"\")","v":""},null,null,null,{"$f":"IF(FL$2=1,Klimadaten!FL40,\"\")","v":""},null,null,null,{"$f":"IF(FP$2=1,Klimadaten!FP40,\"\")","v":""},null,null,null,{"$f":"IF(FT$2=1,Klimadaten!FT40,\"\")","v":""},null,null,null,{"$f":"IF(FX$2=1,Klimadaten!FX40,\"\")","v":""},null,null,null,{"$f":"IF(GB$2=1,Klimadaten!GB40,\"\")","v":""},null,null,null,{"$f":"IF(GF$2=1,Klimadaten!GF40,\"\")","v":""},null,null,null,{"$f":"IF(GJ$2=1,Klimadaten!GJ40,\"\")","v":""},null,null,null,{"$f":"IF(GN$2=1,Klimadaten!GN40,\"\")","v":""},null,null,null,{"$f":"IF(GR$2=1,Klimadaten!GR40,\"\")","v":""},null,null,null,{"$f":"IF(GV$2=1,Klimadaten!GV40,\"\")","v":""},null,null,null,{"$f":"IF(GZ$2=1,Klimadaten!GZ40,\"\")","v":""},null,null,null,{"$f":"IF(HD$2=1,Klimadaten!HD40,\"\")","v":""},null,null,null,{"$f":"IF(HH$2=1,Klimadaten!HH40,\"\")","v":""},null,null,null,{"$f":"IF(HL$2=1,Klimadaten!HL40,\"\")","v":""},null,null,null,{"$f":"IF(HP$2=1,Klimadaten!HP40,\"\")","v":""},null,null,null,{"$f":"IF(HT$2=1,Klimadaten!HT40,\"\")","v":""},null,null,null,{"$f":"IF(HX$2=1,Klimadaten!HX40,\"\")","v":""},null,null,null,{"$f":"IF(IB$2=1,Klimadaten!IB40,\"\")","v":15},null,null,null,{"$f":"IF(IF$2=1,Klimadaten!IF40,\"\")","v":""},null,null,null,{"$f":"IF(IJ$2=1,Klimadaten!IJ40,\"\")","v":""},null,null,null,{"$f":"IF(IN$2=1,Klimadaten!IN40,\"\")","v":""},null,null,null,{"$f":"IF(IR$2=1,Klimadaten!IR40,\"\")","v":""},null,null,null,{"$f":"IF(IV$2=1,Klimadaten!IV40,\"\")","v":""},null,null,null,{"$f":"IF(IZ$2=1,Klimadaten!IZ40,\"\")","v":""},null,null,null,{"$f":"IF(JD$2=1,Klimadaten!JD40,\"\")","v":""},null,null,null,{"$f":"IF(JH$2=1,Klimadaten!JH40,\"\")","v":""},null,null,null,{"$f":"IF(JL$2=1,Klimadaten!JL40,\"\")","v":""}]
[11,null,null,{"$f":"IF(D$2=1,Klimadaten!D41,\"\")","v":15},null,null,null,{"$f":"IF(H$2=1,Klimadaten!H41,\"\")","v":""},null,null,null,{"$f":"IF(L$2=1,Klimadaten!L41,\"\")","v":""},null,null,null,{"$f":"IF(P$2=1,Klimadaten!P41,\"\")","v":14},null,null,null,{"$f":"IF(T$2=1,Klimadaten!T41,\"\")","v":""},null,null,null,{"$f":"IF(X$2=1,Klimadaten!X41,\"\")","v":""},null,null,null,{"$f":"IF(AB$2=1,Klimadaten!AB41,\"\")","v":""},null,null,null,{"$f":"IF(AF$2=1,Klimadaten!AF41,\"\")","v":""},null,null,null,{"$f":"IF(AJ$2=1,Klimadaten!AJ41,\"\")","v":""},null,null,null,{"$f":"IF(AN$2=1,Klimadaten!AN41,\"\")","v":""},null,null,null,{"$f":"IF(AR$2=1,Klimadaten!AR41,\"\")","v":""},null,null,null,{"$f":"IF(AV$2=1,Klimadaten!AV41,\"\")","v":""},null,null,null,{"$f":"IF(AZ$2=1,Klimadaten!AZ41,\"\")","v":""},null,null,null,{"$f":"IF(BD$2=1,Klimadaten!BD41,\"\")","v":""},null,null,null,{"$f":"IF(BH$2=1,Klimadaten!BH41,\"\")","v":""},null,null,null,{"$f":"IF(BL$2=1,Klimadaten!BL41,\"\")","v":""},null,null,null,{"$f":"IF(BP$2=1,Klimadaten!BP41,\"\")","v":""},null,null,null,{"$f":"IF(BT$2=1,Klimadaten!BT41,\"\")","v":14},null,null,null,{"$f":"IF(BX$2=1,Klimadaten!BX41,\"\")","v":""},null,null,null,{"$f":"IF(CB$2=1,Klimadaten!CB41,\"\")","v":""},null,null,null,{"$f":"IF(CF$2=1,Klimadaten!CF41,\"\")","v":""},null,null,null,{"$f":"IF(CJ$2=1,Klimadaten!CJ41,\"\")","v":""},null,null,null,{"$f":"IF(CN$2=1,Klimadaten!CN41,\"\")","v":""},null,null,null,{"$f":"IF(CR$2=1,Klimadaten!CR41,\"\")","v":""},null,null,null,{"$f":"IF(CV$2=1,Klimadaten!CV41,\"\")","v":""},null,null,null,{"$f":"IF(CZ$2=1,Klimadaten!CZ41,\"\")","v":""},null,null,null,{"$f":"IF(DD$2=1,Klimadaten!DD41,\"\")","v":""},null,null,null,{"$f":"IF(DH$2=1,Klimadaten!DH41,\"\")","v":""},null,null,null,{"$f":"IF(DL$2=1,Klimadaten!DL41,\"\")","v":""},null,null,null,{"$f":"IF(DP$2=1,Klimadaten!DP41,\"\")","v":""},null,null,null,{"$f":"IF(DT$2=1,Klimadaten!DT41,\"\")","v":""},null,null,null,{"$f":"IF(DX$2=1,Klimadaten!DX41,\"\")","v":""},null,null,null,{"$f":"IF(EB$2=1,Klimadaten!EB41,\"\")","v":""},null,null,null,{"$f":"IF(EF$2=1,Klimadaten!EF41,\"\")","v":""},null,null,null,{"$f":"IF(EJ$2=1,Klimadaten!EJ41,\"\")","v":""},null,null,null,{"$f":"IF(EN$2=1,Klimadaten!EN41,\"\")","v":""},null,null,null,{"$f":"IF(ER$2=1,Klimadaten!ER41,\"\")","v":""},null,null,null,{"$f":"IF(EV$2=1,Klimadaten!EV41,\"\")","v":""},null,null,null,{"$f":"IF(EZ$2=1,Klimadaten!EZ41,\"\")","v":""},null,null,null,{"$f":"IF(FD$2=1,Klimadaten!FD41,\"\")","v":""},null,null,null,{"$f":"IF(FH$2=1,Klimadaten!FH41,\"\")","v":""},null,null,null,{"$f":"IF(FL$2=1,Klimadaten!FL41,\"\")","v":""},null,null,null,{"$f":"IF(FP$2=1,Klimadaten!FP41,\"\")","v":""},null,null,null,{"$f":"IF(FT$2=1,Klimadaten!FT41,\"\")","v":""},null,null,null,{"$f":"IF(FX$2=1,Klimadaten!FX41,\"\")","v":""},null,null,null,{"$f":"IF(GB$2=1,Klimadaten!GB41,\"\")","v":""},null,null,null,{"$f":"IF(GF$2=1,Klimadaten!GF41,\"\")","v":""},null,null,null,{"$f":"IF(GJ$2=1,Klimadaten!GJ41,\"\")","v":""},null,null,null,{"$f":"IF(GN$2=1,Klimadaten!GN41,\"\")","v":""},null,null,null,{"$f":"IF(GR$2=1,Klimadaten!GR41,\"\")","v":""},null,null,null,{"$f":"IF(GV$2=1,Klimadaten!GV41,\"\")","v":""},null,null,null,{"$f":"IF(GZ$2=1,Klimadaten!GZ41,\"\")","v":""},null,null,null,{"$f":"IF(HD$2=1,Klimadaten!HD41,\"\")","v":""},null,null,null,{"$f":"IF(HH$2=1,Klimadaten!HH41,\"\")","v":""},null,null,null,{"$f":"IF(HL$2=1,Klimadaten!HL41,\"\")","v":""},null,null,null,{"$f":"IF(HP$2=1,Klimadaten!HP41,\"\")","v":""},null,null,null,{"$f":"IF(HT$2=1,Klimadaten!HT41,\"\")","v":""},null,null,null,{"$f":"IF(HX$2=1,Klimadaten!HX41,\"\")","v":""},null,null,null,{"$f":"IF(IB$2=1,Klimadaten!IB41,\"\")","v":14},null,null,null,{"$f":"IF(IF$2=1,Klimadaten!IF41,\"\")","v":""},null,null,null,{"$f":"IF(IJ$2=1,Klimadaten!IJ41,\"\")","v":""},null,null,null,{"$f":"IF(IN$2=1,Klimadaten!IN41,\"\")","v":""},null,null,null,{"$f":"IF(IR$2=1,Klimadaten!IR41,\"\")","v":""},null,null,null,{"$f":"IF(IV$2=1,Klimadaten!IV41,\"\")","v":""},null,null,null,{"$f":"IF(IZ$2=1,Klimadaten!IZ41,\"\")","v":""},null,null,null,{"$f":"IF(JD$2=1,Klimadaten!JD41,\"\")","v":""},null,null,null,{"$f":"IF(JH$2=1,Klimadaten!JH41,\"\")","v":""},null,null,null,{"$f":"IF(JL$2=1,Klimadaten!JL41,\"\")","v":""}]
[12,null,null,{"$f":"IF(D$2=1,Klimadaten!D42,\"\")","v":15},null,null,null,{"$f":"IF(H$2=1,Klimadaten!H42,\"\")","v":""},null,null,null,{"$f":"IF(L$2=1,Klimadaten!L42,\"\")","v":""},null,null,null,{"$f":"IF(P$2=1,Klimadaten!P42,\"\")","v":13},null,null,null,{"$f":"IF(T$2=1,Klimadaten!T42,\"\")","v":""},null,null,null,{"$f":"IF(X$2=1,Klimadaten!X42,\"\")","v":""},null,null,null,{"$f":"IF(AB$2=1,Klimadaten!AB42,\"\")","v":""},null,null,null,{"$f":"IF(AF$2=1,Klimadaten!AF42,\"\")","v":""},null,null,null,{"$f":"IF(AJ$2=1,Klimadaten!AJ42,\"\")","v":""},null,null,null,{"$f":"IF(AN$2=1,Klimadaten!AN42,\"\")","v":""},null,null,null,{"$f":"IF(AR$2=1,Klimadaten!AR42,\"\")","v":""},null,null,null,{"$f":"IF(AV$2=1,Klimadaten!AV42,\"\")","v":""},null,null,null,{"$f":"IF(AZ$2=1,Klimadaten!AZ42,\"\")","v":""},null,null,null,{"$f":"IF(BD$2=1,Klimadaten!BD42,\"\")","v":""},null,null,null,{"$f":"IF(BH$2=1,Klimadaten!BH42,\"\")","v":""},null,null,null,{"$f":"IF(BL$2=1,Klimadaten!BL42,\"\")","v":""},null,null,null,{"$f":"IF(BP$2=1,Klimadaten!BP42,\"\")","v":""},null,null,null,{"$f":"IF(BT$2=1,Klimadaten!BT42,\"\")","v":16},null,null,null,{"$f":"IF(BX$2=1,Klimadaten!BX42,\"\")","v":""},null,null,null,{"$f":"IF(CB$2=1,Klimadaten!CB42,\"\")","v":""},null,null,null,{"$f":"IF(CF$2=1,Klimadaten!CF42,\"\")","v":""},null,null,null,{"$f":"IF(CJ$2=1,Klimadaten!CJ42,\"\")","v":""},null,null,null,{"$f":"IF(CN$2=1,Klimadaten!CN42,\"\")","v":""},null,null,null,{"$f":"IF(CR$2=1,Klimadaten!CR42,\"\")","v":""},null,null,null,{"$f":"IF(CV$2=1,Klimadaten!CV42,\"\")","v":""},null,null,null,{"$f":"IF(CZ$2=1,Klimadaten!CZ42,\"\")","v":""},null,null,null,{"$f":"IF(DD$2=1,Klimadaten!DD42,\"\")","v":""},null,null,null,{"$f":"IF(DH$2=1,Klimadaten!DH42,\"\")","v":""},null,null,null,{"$f":"IF(DL$2=1,Klimadaten!DL42,\"\")","v":""},null,null,null,{"$f":"IF(DP$2=1,Klimadaten!DP42,\"\")","v":""},null,null,null,{"$f":"IF(DT$2=1,Klimadaten!DT42,\"\")","v":""},null,null,null,{"$f":"IF(DX$2=1,Klimadaten!DX42,\"\")","v":""},null,null,null,{"$f":"IF(EB$2=1,Klimadaten!EB42,\"\")","v":""},null,null,null,{"$f":"IF(EF$2=1,Klimadaten!EF42,\"\")","v":""},null,null,null,{"$f":"IF(EJ$2=1,Klimadaten!EJ42,\"\")","v":""},null,null,null,{"$f":"IF(EN$2=1,Klimadaten!EN42,\"\")","v":""},null,null,null,{"$f":"IF(ER$2=1,Klimadaten!ER42,\"\")","v":""},null,null,null,{"$f":"IF(EV$2=1,Klimadaten!EV42,\"\")","v":""},null,null,null,{"$f":"IF(EZ$2=1,Klimadaten!EZ42,\"\")","v":""},null,null,null,{"$f":"IF(FD$2=1,Klimadaten!FD42,\"\")","v":""},null,null,null,{"$f":"IF(FH$2=1,Klimadaten!FH42,\"\")","v":""},null,null,null,{"$f":"IF(FL$2=1,Klimadaten!FL42,\"\")","v":""},null,null,null,{"$f":"IF(FP$2=1,Klimadaten!FP42,\"\")","v":""},null,null,null,{"$f":"IF(FT$2=1,Klimadaten!FT42,\"\")","v":""},null,null,null,{"$f":"IF(FX$2=1,Klimadaten!FX42,\"\")","v":""},null,null,null,{"$f":"IF(GB$2=1,Klimadaten!GB42,\"\")","v":""},null,null,null,{"$f":"IF(GF$2=1,Klimadaten!GF42,\"\")","v":""},null,null,null,{"$f":"IF(GJ$2=1,Klimadaten!GJ42,\"\")","v":""},null,null,null,{"$f":"IF(GN$2=1,Klimadaten!GN42,\"\")","v":""},null,null,null,{"$f":"IF(GR$2=1,Klimadaten!GR42,\"\")","v":""},null,null,null,{"$f":"IF(GV$2=1,Klimadaten!GV42,\"\")","v":""},null,null,null,{"$f":"IF(GZ$2=1,Klimadaten!GZ42,\"\")","v":""},null,null,null,{"$f":"IF(HD$2=1,Klimadaten!HD42,\"\")","v":""},null,null,null,{"$f":"IF(HH$2=1,Klimadaten!HH42,\"\")","v":""},null,null,null,{"$f":"IF(HL$2=1,Klimadaten!HL42,\"\")","v":""},null,null,null,{"$f":"IF(HP$2=1,Klimadaten!HP42,\"\")","v":""},null,null,null,{"$f":"IF(HT$2=1,Klimadaten!HT42,\"\")","v":""},null,null,null,{"$f":"IF(HX$2=1,Klimadaten!HX42,\"\")","v":""},null,null,null,{"$f":"IF(IB$2=1,Klimadaten!IB42,\"\")","v":12},null,null,null,{"$f":"IF(IF$2=1,Klimadaten!IF42,\"\")","v":""},null,null,null,{"$f":"IF(IJ$2=1,Klimadaten!IJ42,\"\")","v":""},null,null,null,{"$f":"IF(IN$2=1,Klimadaten!IN42,\"\")","v":""},null,null,null,{"$f":"IF(IR$2=1,Klimadaten!IR42,\"\")","v":""},null,null,null,{"$f":"IF(IV$2=1,Klimadaten!IV42,\"\")","v":""},null,null,null,{"$f":"IF(IZ$2=1,Klimadaten!IZ42,\"\")","v":""},null,null,null,{"$f":"IF(JD$2=1,Klimadaten!JD42,\"\")","v":""},null,null,null,{"$f":"IF(JH$2=1,Klimadaten!JH42,\"\")","v":""},null,null,null,{"$f":"IF(JL$2=1,Klimadaten!JL42,\"\")","v":""}]
[13,null,null,{"$f":"IF(D$2=1,Klimadaten!D43,\"\")","v":14},null,null,null,{"$f":"IF(H$2=1,Klimadaten!H43,\"\")","v":""},null,null,null,{"$f":"IF(L$2=1,Klimadaten!L43,\"\")","v":""},null,null,null,{"$f":"IF(P$2=1,Klimadaten!P43,\"\")","v":16},null,null,null,{"$f":"IF(T$2=1,Klimadaten!T43,\"\")","v":""},null,null,null,{"$f":"IF(X$2=1,Klimadaten!X43,\"\")","v":""},null,null,null,{"$f":"IF(AB$2=1,Klimadaten!AB43,\"\")","v":""},null,null,null,{"$f":"IF(AF$2=1,Klimadaten!AF43,\"\")","v":""},null,null,null,{"$f":"IF(AJ$2=1,Klimadaten!AJ43,\"\")","v":""},null,null,null,{"$f":"IF(AN$2=1,Klimadaten!AN43,\"\")","v":""},null,null,null,{"$f":"IF(AR$2=1,Klimadaten!AR43,\"\")","v":""},null,null,null,{"$f":"IF(AV$2=1,Klimadaten!AV43,\"\")","v":""},null,null,null,{"$f":"IF(AZ$2=1,Klimadaten!AZ43,\"\")","v":""},null,null,null,{"$f":"IF(BD$2=1,Klimadaten!BD43,\"\")","v":""},null,null,null,{"$f":"IF(BH$2=1,Klimadaten!BH43,\"\")","v":""},null,null,null,{"$f":"IF(BL$2=1,Klimadaten!BL43,\"\")","v":""},null,null,null,{"$f":"IF(BP$2=1,Klimadaten!BP43,\"\")","v":""},null,null,null,{"$f":"IF(BT$2=1,Klimadaten!BT43,\"\")","v":15},null,null,null,{"$f":"IF(BX$2=1,Klimadaten!BX43,\"\")","v":""},null,null,null,{"$f":"IF(CB$2=1,Klimadaten!CB43,\"\")","v":""},null,null,null,{"$f":"IF(CF$2=1,Klimadaten!CF43,\"\")","v":""},null,null,null,{"$f":"IF(CJ$2=1,Klimadaten!CJ43,\"\")","v":""},null,null,null,{"$f":"IF(CN$2=1,Klimadaten!CN43,\"\")","v":""},null,null,null,{"$f":"IF(CR$2=1,Klimadaten!CR43,\"\")","v":""},null,null,null,{"$f":"IF(CV$2=1,Klimadaten!CV43,\"\")","v":""},null,null,null,{"$f":"IF(CZ$2=1,Klimadaten!CZ43,\"\")","v":""},null,null,null,{"$f":"IF(DD$2=1,Klimadaten!DD43,\"\")","v":""},null,null,null,{"$f":"IF(DH$2=1,Klimadaten!DH43,\"\")","v":""},null,null,null,{"$f":"IF(DL$2=1,Klimadaten!DL43,\"\")","v":""},null,null,null,{"$f":"IF(DP$2=1,Klimadaten!DP43,\"\")","v":""},null,null,null,{"$f":"IF(DT$2=1,Klimadaten!DT43,\"\")","v":""},null,null,null,{"$f":"IF(DX$2=1,Klimadaten!DX43,\"\")","v":""},null,null,null,{"$f":"IF(EB$2=1,Klimadaten!EB43,\"\")","v":""},null,null,null,{"$f":"IF(EF$2=1,Klimadaten!EF43,\"\")","v":""},null,null,null,{"$f":"IF(EJ$2=1,Klimadaten!EJ43,\"\")","v":""},null,null,null,{"$f":"IF(EN$2=1,Klimadaten!EN43,\"\")","v":""},null,null,null,{"$f":"IF(ER$2=1,Klimadaten!ER43,\"\")","v":""},null,null,null,{"$f":"IF(EV$2=1,Klimadaten!EV43,\"\")","v":""},null,null,null,{"$f":"IF(EZ$2=1,Klimadaten!EZ43,\"\")","v":""},null,null,null,{"$f":"IF(FD$2=1,Klimadaten!FD43,\"\")","v":""},null,null,null,{"$f":"IF(FH$2=1,Klimadaten!FH43,\"\")","v":""},null,null,null,{"$f":"IF(FL$2=1,Klimadaten!FL43,\"\")","v":""},null,null,null,{"$f":"IF(FP$2=1,Klimadaten!FP43,\"\")","v":""},null,null,null,{"$f":"IF(FT$2=1,Klimadaten!FT43,\"\")","v":""},null,null,null,{"$f":"IF(FX$2=1,Klimadaten!FX43,\"\")","v":""},null,null,null,{"$f":"IF(GB$2=1,Klimadaten!GB43,\"\")","v":""},null,null,null,{"$f":"IF(GF$2=1,Klimadaten!GF43,\"\")","v":""},null,null,null,{"$f":"IF(GJ$2=1,Klimadaten!GJ43,\"\")","v":""},null,null,null,{"$f":"IF(GN$2=1,Klimadaten!GN43,\"\")","v":""},null,null,null,{"$f":"IF(GR$2=1,Klimadaten!GR43,\"\")","v":""},null,null,null,{"$f":"IF(GV$2=1,Klimadaten!GV43,\"\")","v":""},null,null,null,{"$f":"IF(GZ$2=1,Klimadaten!GZ43,\"\")","v":""},null,null,null,{"$f":"IF(HD$2=1,Klimadaten!HD43,\"\")","v":""},null,null,null,{"$f":"IF(HH$2=1,Klimadaten!HH43,\"\")","v":""},null,null,null,{"$f":"IF(HL$2=1,Klimadaten!HL43,\"\")","v":""},null,null,null,{"$f":"IF(HP$2=1,Klimadaten!HP43,\"\")","v":""},null,null,null,{"$f":"IF(HT$2=1,Klimadaten!HT43,\"\")","v":""},null,null,null,{"$f":"IF(HX$2=1,Klimadaten!HX43,\"\")","v":""},null,null,null,{"$f":"IF(IB$2=1,Klimadaten!IB43,\"\")","v":14},null,null,null,{"$f":"IF(IF$2=1,Klimadaten!IF43,\"\")","v":""},null,null,null,{"$f":"IF(IJ$2=1,Klimadaten!IJ43,\"\")","v":""},null,null,null,{"$f":"IF(IN$2=1,Klimadaten!IN43,\"\")","v":""},null,null,null,{"$f":"IF(IR$2=1,Klimadaten!IR43,\"\")","v":""},null,null,null,{"$f":"IF(IV$2=1,Klimadaten!IV43,\"\")","v":""},null,null,null,{"$f":"IF(IZ$2=1,Klimadaten!IZ43,\"\")","v":""},null,null,null,{"$f":"IF(JD$2=1,Klimadaten!JD43,\"\")","v":""},null,null,null,{"$f":"IF(JH$2=1,Klimadaten!JH43,\"\")","v":""},null,null,null,{"$f":"IF(JL$2=1,Klimadaten!JL43,\"\")","v":""}]
[14,null,null,{"$f":"IF(D$2=1,Klimadaten!D44,\"\")","v":11},null,null,null,{"$f":"IF(H$2=1,Klimadaten!H44,\"\")","v":""},null,null,null,{"$f":"IF(L$2=1,Klimadaten!L44,\"\")","v":""},null,null,null,{"$f":"IF(P$2=1,Klimadaten!P44,\"\")","v":13},null,null,null,{"$f":"IF(T$2=1,Klimadaten!T44,\"\")","v":""},null,null,null,{"$f":"IF(X$2=1,Klimadaten!X44,\"\")","v":""},null,null,null,{"$f":"IF(AB$2=1,Klimadaten!AB44,\"\")","v":""},null,null,null,{"$f":"IF(AF$2=1,Klimadaten!AF44,\"\")","v":""},null,null,null,{"$f":"IF(AJ$2=1,Klimadaten!AJ44,\"\")","v":""},null,null,null,{"$f":"IF(AN$2=1,Klimadaten!AN44,\"\")","v":""},null,null,null,{"$f":"IF(AR$2=1,Klimadaten!AR44,\"\")","v":""},null,null,null,{"$f":"IF(AV$2=1,Klimadaten!AV44,\"\")","v":""},null,null,null,{"$f":"IF(AZ$2=1,Klimadaten!AZ44,\"\")","v":""},null,null,null,{"$f":"IF(BD$2=1,Klimadaten!BD44,\"\")","v":""},null,null,null,{"$f":"IF(BH$2=1,Klimadaten!BH44,\"\")","v":""},null,null,null,{"$f":"IF(BL$2=1,Klimadaten!BL44,\"\")","v":""},null,null,null,{"$f":"IF(BP$2=1,Klimadaten!BP44,\"\")","v":""},null,null,null,{"$f":"IF(BT$2=1,Klimadaten!BT44,\"\")","v":16},null,null,null,{"$f":"IF(BX$2=1,Klimadaten!BX44,\"\")","v":""},null,null,null,{"$f":"IF(CB$2=1,Klimadaten!CB44,\"\")","v":""},null,null,null,{"$f":"IF(CF$2=1,Klimadaten!CF44,\"\")","v":""},null,null,null,{"$f":"IF(CJ$2=1,Klimadaten!CJ44,\"\")","v":""},null,null,null,{"$f":"IF(CN$2=1,Klimadaten!CN44,\"\")","v":""},null,null,null,{"$f":"IF(CR$2=1,Klimadaten!CR44,\"\")","v":""},null,null,null,{"$f":"IF(CV$2=1,Klimadaten!CV44,\"\")","v":""},null,null,null,{"$f":"IF(CZ$2=1,Klimadaten!CZ44,\"\")","v":""},null,null,null,{"$f":"IF(DD$2=1,Klimadaten!DD44,\"\")","v":""},null,null,null,{"$f":"IF(DH$2=1,Klimadaten!DH44,\"\")","v":""},null,null,null,{"$f":"IF(DL$2=1,Klimadaten!DL44,\"\")","v":""},null,null,null,{"$f":"IF(DP$2=1,Klimadaten!DP44,\"\")","v":""},null,null,null,{"$f":"IF(DT$2=1,Klimadaten!DT44,\"\")","v":""},null,null,null,{"$f":"IF(DX$2=1,Klimadaten!DX44,\"\")","v":""},null,null,null,{"$f":"IF(EB$2=1,Klimadaten!EB44,\"\")","v":""},null,null,null,{"$f":"IF(EF$2=1,Klimadaten!EF44,\"\")","v":""},null,null,null,{"$f":"IF(EJ$2=1,Klimadaten!EJ44,\"\")","v":""},null,null,null,{"$f":"IF(EN$2=1,Klimadaten!EN44,\"\")","v":""},null,null,null,{"$f":"IF(ER$2=1,Klimadaten!ER44,\"\")","v":""},null,null,null,{"$f":"IF(EV$2=1,Klimadaten!EV44,\"\")","v":""},null,null,null,{"$f":"IF(EZ$2=1,Klimadaten!EZ44,\"\")","v":""},null,null,null,{"$f":"IF(FD$2=1,Klimadaten!FD44,\"\")","v":""},null,null,null,{"$f":"IF(FH$2=1,Klimadaten!FH44,\"\")","v":""},null,null,null,{"$f":"IF(FL$2=1,Klimadaten!FL44,\"\")","v":""},null,null,null,{"$f":"IF(FP$2=1,Klimadaten!FP44,\"\")","v":""},null,null,null,{"$f":"IF(FT$2=1,Klimadaten!FT44,\"\")","v":""},null,null,null,{"$f":"IF(FX$2=1,Klimadaten!FX44,\"\")","v":""},null,null,null,{"$f":"IF(GB$2=1,Klimadaten!GB44,\"\")","v":""},null,null,null,{"$f":"IF(GF$2=1,Klimadaten!GF44,\"\")","v":""},null,null,null,{"$f":"IF(GJ$2=1,Klimadaten!GJ44,\"\")","v":""},null,null,null,{"$f":"IF(GN$2=1,Klimadaten!GN44,\"\")","v":""},null,null,null,{"$f":"IF(GR$2=1,Klimadaten!GR44,\"\")","v":""},null,null,null,{"$f":"IF(GV$2=1,Klimadaten!GV44,\"\")","v":""},null,null,null,{"$f":"IF(GZ$2=1,Klimadaten!GZ44,\"\")","v":""},null,null,null,{"$f":"IF(HD$2=1,Klimadaten!HD44,\"\")","v":""},null,null,null,{"$f":"IF(HH$2=1,Klimadaten!HH44,\"\")","v":""},null,null,null,{"$f":"IF(HL$2=1,Klimadaten!HL44,\"\")","v":""},null,null,null,{"$f":"IF(HP$2=1,Klimadaten!HP44,\"\")","v":""},null,null,null,{"$f":"IF(HT$2=1,Klimadaten!HT44,\"\")","v":""},null,null,null,{"$f":"IF(HX$2=1,Klimadaten!HX44,\"\")","v":""},null,null,null,{"$f":"IF(IB$2=1,Klimadaten!IB44,\"\")","v":15},null,null,null,{"$f":"IF(IF$2=1,Klimadaten!IF44,\"\")","v":""},null,null,null,{"$f":"IF(IJ$2=1,Klimadaten!IJ44,\"\")","v":""},null,null,null,{"$f":"IF(IN$2=1,Klimadaten!IN44,\"\")","v":""},null,null,null,{"$f":"IF(IR$2=1,Klimadaten!IR44,\"\")","v":""},null,null,null,{"$f":"IF(IV$2=1,Klimadaten!IV44,\"\")","v":""},null,null,null,{"$f":"IF(IZ$2=1,Klimadaten!IZ44,\"\")","v":""},null,null,null,{"$f":"IF(JD$2=1,Klimadaten!JD44,\"\")","v":""},null,null,null,{"$f":"IF(JH$2=1,Klimadaten!JH44,\"\")","v":""},null,null,null,{"$f":"IF(JL$2=1,Klimadaten!JL44,\"\")","v":""}]
[15,null,null,{"$f":"IF(D$2=1,Klimadaten!D45,\"\")","v":12},null,null,null,{"$f":"IF(H$2=1,Klimadaten!H45,\"\")","v":""},null,null,null,{"$f":"IF(L$2=1,Klimadaten!L45,\"\")","v":""},null,null,null,{"$f":"IF(P$2=1,Klimadaten!P45,\"\")","v":14},null,null,null,{"$f":"IF(T$2=1,Klimadaten!T45,\"\")","v":""},null,null,null,{"$f":"IF(X$2=1,Klimadaten!X45,\"\")","v":""},null,null,null,{"$f":"IF(AB$2=1,Klimadaten!AB45,\"\")","v":""},null,null,null,{"$f":"IF(AF$2=1,Klimadaten!AF45,\"\")","v":""},null,null,null,{"$f":"IF(AJ$2=1,Klimadaten!AJ45,\"\")","v":""},null,null,null,{"$f":"IF(AN$2=1,Klimadaten!AN45,\"\")","v":""},null,null,null,{"$f":"IF(AR$2=1,Klimadaten!AR45,\"\")","v":""},null,null,null,{"$f":"IF(AV$2=1,Klimadaten!AV45,\"\")","v":""},null,null,null,{"$f":"IF(AZ$2=1,Klimadaten!AZ45,\"\")","v":""},null,null,null,{"$f":"IF(BD$2=1,Klimadaten!BD45,\"\")","v":""},null,null,null,{"$f":"IF(BH$2=1,Klimadaten!BH45,\"\")","v":""},null,null,null,{"$f":"IF(BL$2=1,Klimadaten!BL45,\"\")","v":""},null,null,null,{"$f":"IF(BP$2=1,Klimadaten!BP45,\"\")","v":""},null,null,null,{"$f":"IF(BT$2=1,Klimadaten!BT45,\"\")","v":16},null,null,null,{"$f":"IF(BX$2=1,Klimadaten!BX45,\"\")","v":""},null,null,null,{"$f":"IF(CB$2=1,Klimadaten!CB45,\"\")","v":""},null,null,null,{"$f":"IF(CF$2=1,Klimadaten!CF45,\"\")","v":""},null,null,null,{"$f":"IF(CJ$2=1,Klimadaten!CJ45,\"\")","v":""},null,null,null,{"$f":"IF(CN$2=1,Klimadaten!CN45,\"\")","v":""},null,null,null,{"$f":"IF(CR$2=1,Klimadaten!CR45,\"\")","v":""},null,null,null,{"$f":"IF(CV$2=1,Klimadaten!CV45,\"\")","v":""},null,null,null,{"$f":"IF(CZ$2=1,Klimadaten!CZ45,\"\")","v":""},null,null,null,{"$f":"IF(DD$2=1,Klimadaten!DD45,\"\")","v":""},null,null,null,{"$f":"IF(DH$2=1,Klimadaten!DH45,\"\")","v":""},null,null,null,{"$f":"IF(DL$2=1,Klimadaten!DL45,\"\")","v":""},null,null,null,{"$f":"IF(DP$2=1,Klimadaten!DP45,\"\")","v":""},null,null,null,{"$f":"IF(DT$2=1,Klimadaten!DT45,\"\")","v":""},null,null,null,{"$f":"IF(DX$2=1,Klimadaten!DX45,\"\")","v":""},null,null,null,{"$f":"IF(EB$2=1,Klimadaten!EB45,\"\")","v":""},null,null,null,{"$f":"IF(EF$2=1,Klimadaten!EF45,\"\")","v":""},null,null,null,{"$f":"IF(EJ$2=1,Klimadaten!EJ45,\"\")","v":""},null,null,null,{"$f":"IF(EN$2=1,Klimadaten!EN45,\"\")","v":""},null,null,null,{"$f":"IF(ER$2=1,Klimadaten!ER45,\"\")","v":""},null,null,null,{"$f":"IF(EV$2=1,Klimadaten!EV45,\"\")","v":""},null,null,null,{"$f":"IF(EZ$2=1,Klimadaten!EZ45,\"\")","v":""},null,null,null,{"$f":"IF(FD$2=1,Klimadaten!FD45,\"\")","v":""},null,null,null,{"$f":"IF(FH$2=1,Klimadaten!FH45,\"\")","v":""},null,null,null,{"$f":"IF(FL$2=1,Klimadaten!FL45,\"\")","v":""},null,null,null,{"$f":"IF(FP$2=1,Klimadaten!FP45,\"\")","v":""},null,null,null,{"$f":"IF(FT$2=1,Klimadaten!FT45,\"\")","v":""},null,null,null,{"$f":"IF(FX$2=1,Klimadaten!FX45,\"\")","v":""},null,null,null,{"$f":"IF(GB$2=1,Klimadaten!GB45,\"\")","v":""},null,null,null,{"$f":"IF(GF$2=1,Klimadaten!GF45,\"\")","v":""},null,null,null,{"$f":"IF(GJ$2=1,Klimadaten!GJ45,\"\")","v":""},null,null,null,{"$f":"IF(GN$2=1,Klimadaten!GN45,\"\")","v":""},null,null,null,{"$f":"IF(GR$2=1,Klimadaten!GR45,\"\")","v":""},null,null,null,{"$f":"IF(GV$2=1,Klimadaten!GV45,\"\")","v":""},null,null,null,{"$f":"IF(GZ$2=1,Klimadaten!GZ45,\"\")","v":""},null,null,null,{"$f":"IF(HD$2=1,Klimadaten!HD45,\"\")","v":""},null,null,null,{"$f":"IF(HH$2=1,Klimadaten!HH45,\"\")","v":""},null,null,null,{"$f":"IF(HL$2=1,Klimadaten!HL45,\"\")","v":""},null,null,null,{"$f":"IF(HP$2=1,Klimadaten!HP45,\"\")","v":""},null,null,null,{"$f":"IF(HT$2=1,Klimadaten!HT45,\"\")","v":""},null,null,null,{"$f":"IF(HX$2=1,Klimadaten!HX45,\"\")","v":""},null,null,null,{"$f":"IF(IB$2=1,Klimadaten!IB45,\"\")","v":14},null,null,null,{"$f":"IF(IF$2=1,Klimadaten!IF45,\"\")","v":""},null,null,null,{"$f":"IF(IJ$2=1,Klimadaten!IJ45,\"\")","v":""},null,null,null,{"$f":"IF(IN$2=1,Klimadaten!IN45,\"\")","v":""},null,null,null,{"$f":"IF(IR$2=1,Klimadaten!IR45,\"\")","v":""},null,null,null,{"$f":"IF(IV$2=1,Klimadaten!IV45,\"\")","v":""},null,null,null,{"$f":"IF(IZ$2=1,Klimadaten!IZ45,\"\")","v":""},null,null,null,{"$f":"IF(JD$2=1,Klimadaten!JD45,\"\")","v":""},null,null,null,{"$f":"IF(JH$2=1,Klimadaten!JH45,\"\")","v":""},null,null,null,{"$f":"IF(JL$2=1,Klimadaten!JL45,\"\")","v":""}]
[16,null,null,{"$f":"IF(D$2=1,Klimadaten!D46,\"\")","v":6},null,null,null,{"$f":"IF(H$2=1,Klimadaten!H46,\"\")","v":""},null,null,null,{"$f":"IF(L$2=1,Klimadaten!L46,\"\")","v":""},null,null,null,{"$f":"IF(P$2=1,Klimadaten!P46,\"\")","v":14},null,null,null,{"$f":"IF(T$2=1,Klimadaten!T46,\"\")","v":""},null,null,null,{"$f":"IF(X$2=1,Klimadaten!X46,\"\")","v":""},null,null,null,{"$f":"IF(AB$2=1,Klimadaten!AB46,\"\")","v":""},null,null,null,{"$f":"IF(AF$2=1,Klimadaten!AF46,\"\")","v":""},null,null,null,{"$f":"IF(AJ$2=1,Klimadaten!AJ46,\"\")","v":""},null,null,null,{"$f":"IF(AN$2=1,Klimadaten!AN46,\"\")","v":""},null,null,null,{"$f":"IF(AR$2=1,Klimadaten!AR46,\"\")","v":""},null,null,null,{"$f":"IF(AV$2=1,Klimadaten!AV46,\"\")","v":""},null,null,null,{"$f":"IF(AZ$2=1,Klimadaten!AZ46,\"\")","v":""},null,null,null,{"$f":"IF(BD$2=1,Klimadaten!BD46,\"\")","v":""},null,null,null,{"$f":"IF(BH$2=1,Klimadaten!BH46,\"\")","v":""},null,null,null,{"$f":"IF(BL$2=1,Klimadaten!BL46,\"\")","v":""},null,null,null,{"$f":"IF(BP$2=1,Klimadaten!BP46,\"\")","v":""},null,null,null,{"$f":"IF(BT$2=1,Klimadaten!BT46,\"\")","v":15},null,null,null,{"$f":"IF(BX$2=1,Klimadaten!BX46,\"\")","v":""},null,null,null,{"$f":"IF(CB$2=1,Klimadaten!CB46,\"\")","v":""},null,null,null,{"$f":"IF(CF$2=1,Klimadaten!CF46,\"\")","v":""},null,null,null,{"$f":"IF(CJ$2=1,Klimadaten!CJ46,\"\")","v":""},null,null,null,{"$f":"IF(CN$2=1,Klimadaten!CN46,\"\")","v":""},null,null,null,{"$f":"IF(CR$2=1,Klimadaten!CR46,\"\")","v":""},null,null,null,{"$f":"IF(CV$2=1,Klimadaten!CV46,\"\")","v":""},null,null,null,{"$f":"IF(CZ$2=1,Klimadaten!CZ46,\"\")","v":""},null,null,null,{"$f":"IF(DD$2=1,Klimadaten!DD46,\"\")","v":""},null,null,null,{"$f":"IF(DH$2=1,Klimadaten!DH46,\"\")","v":""},null,null,null,{"$f":"IF(DL$2=1,Klimadaten!DL46,\"\")","v":""},null,null,null,{"$f":"IF(DP$2=1,Klimadaten!DP46,\"\")","v":""},null,null,null,{"$f":"IF(DT$2=1,Klimadaten!DT46,\"\")","v":""},null,null,null,{"$f":"IF(DX$2=1,Klimadaten!DX46,\"\")","v":""},null,null,null,{"$f":"IF(EB$2=1,Klimadaten!EB46,\"\")","v":""},null,null,null,{"$f":"IF(EF$2=1,Klimadaten!EF46,\"\")","v":""},null,null,null,{"$f":"IF(EJ$2=1,Klimadaten!EJ46,\"\")","v":""},null,null,null,{"$f":"IF(EN$2=1,Klimadaten!EN46,\"\")","v":""},null,null,null,{"$f":"IF(ER$2=1,Klimadaten!ER46,\"\")","v":""},null,null,null,{"$f":"IF(EV$2=1,Klimadaten!EV46,\"\")","v":""},null,null,null,{"$f":"IF(EZ$2=1,Klimadaten!EZ46,\"\")","v":""},null,null,null,{"$f":"IF(FD$2=1,Klimadaten!FD46,\"\")","v":""},null,null,null,{"$f":"IF(FH$2=1,Klimadaten!FH46,\"\")","v":""},null,null,null,{"$f":"IF(FL$2=1,Klimadaten!FL46,\"\")","v":""},null,null,null,{"$f":"IF(FP$2=1,Klimadaten!FP46,\"\")","v":""},null,null,null,{"$f":"IF(FT$2=1,Klimadaten!FT46,\"\")","v":""},null,null,null,{"$f":"IF(FX$2=1,Klimadaten!FX46,\"\")","v":""},null,null,null,{"$f":"IF(GB$2=1,Klimadaten!GB46,\"\")","v":""},null,null,null,{"$f":"IF(GF$2=1,Klimadaten!GF46,\"\")","v":""},null,null,null,{"$f":"IF(GJ$2=1,Klimadaten!GJ46,\"\")","v":""},null,null,null,{"$f":"IF(GN$2=1,Klimadaten!GN46,\"\")","v":""},null,null,null,{"$f":"IF(GR$2=1,Klimadaten!GR46,\"\")","v":""},null,null,null,{"$f":"IF(GV$2=1,Klimadaten!GV46,\"\")","v":""},null,null,null,{"$f":"IF(GZ$2=1,Klimadaten!GZ46,\"\")","v":""},null,null,null,{"$f":"IF(HD$2=1,Klimadaten!HD46,\"\")","v":""},null,null,null,{"$f":"IF(HH$2=1,Klimadaten!HH46,\"\")","v":""},null,null,null,{"$f":"IF(HL$2=1,Klimadaten!HL46,\"\")","v":""},null,null,null,{"$f":"IF(HP$2=1,Klimadaten!HP46,\"\")","v":""},null,null,null,{"$f":"IF(HT$2=1,Klimadaten!HT46,\"\")","v":""},null,null,null,{"$f":"IF(HX$2=1,Klimadaten!HX46,\"\")","v":""},null,null,null,{"$f":"IF(IB$2=1,Klimadaten!IB46,\"\")","v":17},null,null,null,{"$f":"IF(IF$2=1,Klimadaten!IF46,\"\")","v":""},null,null,null,{"$f":"IF(IJ$2=1,Klimadaten!IJ46,\"\")","v":""},null,null,null,{"$f":"IF(IN$2=1,Klimadaten!IN46,\"\")","v":""},null,null,null,{"$f":"IF(IR$2=1,Klimadaten!IR46,\"\")","v":""},null,null,null,{"$f":"IF(IV$2=1,Klimadaten!IV46,\"\")","v":""},null,null,null,{"$f":"IF(IZ$2=1,Klimadaten!IZ46,\"\")","v":""},null,null,null,{"$f":"IF(JD$2=1,Klimadaten!JD46,\"\")","v":""},null,null,null,{"$f":"IF(JH$2=1,Klimadaten!JH46,\"\")","v":""},null,null,null,{"$f":"IF(JL$2=1,Klimadaten!JL46,\"\")","v":""}]
[17,null,null,{"$f":"IF(D$2=1,Klimadaten!D47,\"\")","v":5},null,null,null,{"$f":"IF(H$2=1,Klimadaten!H47,\"\")","v":""},null,null,null,{"$f":"IF(L$2=1,Klimadaten!L47,\"\")","v":""},null,null,null,{"$f":"IF(P$2=1,Klimadaten!P47,\"\")","v":14},null,null,null,{"$f":"IF(T$2=1,Klimadaten!T47,\"\")","v":""},null,null,null,{"$f":"IF(X$2=1,Klimadaten!X47,\"\")","v":""},null,null,null,{"$f":"IF(AB$2=1,Klimadaten!AB47,\"\")","v":""},null,null,null,{"$f":"IF(AF$2=1,Klimadaten!AF47,\"\")","v":""},null,null,null,{"$f":"IF(AJ$2=1,Klimadaten!AJ47,\"\")","v":""},null,null,null,{"$f":"IF(AN$2=1,Klimadaten!AN47,\"\")","v":""},null,null,null,{"$f":"IF(AR$2=1,Klimadaten!AR47,\"\")","v":""},null,null,null,{"$f":"IF(AV$2=1,Klimadaten!AV47,\"\")","v":""},null,null,null,{"$f":"IF(AZ$2=1,Klimadaten!AZ47,\"\")","v":""},null,null,null,{"$f":"IF(BD$2=1,Klimadaten!BD47,\"\")","v":""},null,null,null,{"$f":"IF(BH$2=1,Klimadaten!BH47,\"\")","v":""},null,null,null,{"$f":"IF(BL$2=1,Klimadaten!BL47,\"\")","v":""},null,null,null,{"$f":"IF(BP$2=1,Klimadaten!BP47,\"\")","v":""},null,null,null,{"$f":"IF(BT$2=1,Klimadaten!BT47,\"\")","v":13},null,null,null,{"$f":"IF(BX$2=1,Klimadaten!BX47,\"\")","v":""},null,null,null,{"$f":"IF(CB$2=1,Klimadaten!CB47,\"\")","v":""},null,null,null,{"$f":"IF(CF$2=1,Klimadaten!CF47,\"\")","v":""},null,null,null,{"$f":"IF(CJ$2=1,Klimadaten!CJ47,\"\")","v":""},null,null,null,{"$f":"IF(CN$2=1,Klimadaten!CN47,\"\")","v":""},null,null,null,{"$f":"IF(CR$2=1,Klimadaten!CR47,\"\")","v":""},null,null,null,{"$f":"IF(CV$2=1,Klimadaten!CV47,\"\")","v":""},null,null,null,{"$f":"IF(CZ$2=1,Klimadaten!CZ47,\"\")","v":""},null,null,null,{"$f":"IF(DD$2=1,Klimadaten!DD47,\"\")","v":""},null,null,null,{"$f":"IF(DH$2=1,Klimadaten!DH47,\"\")","v":""},null,null,null,{"$f":"IF(DL$2=1,Klimadaten!DL47,\"\")","v":""},null,null,null,{"$f":"IF(DP$2=1,Klimadaten!DP47,\"\")","v":""},null,null,null,{"$f":"IF(DT$2=1,Klimadaten!DT47,\"\")","v":""},null,null,null,{"$f":"IF(DX$2=1,Klimadaten!DX47,\"\")","v":""},null,null,null,{"$f":"IF(EB$2=1,Klimadaten!EB47,\"\")","v":""},null,null,null,{"$f":"IF(EF$2=1,Klimadaten!EF47,\"\")","v":""},null,null,null,{"$f":"IF(EJ$2=1,Klimadaten!EJ47,\"\")","v":""},null,null,null,{"$f":"IF(EN$2=1,Klimadaten!EN47,\"\")","v":""},null,null,null,{"$f":"IF(ER$2=1,Klimadaten!ER47,\"\")","v":""},null,null,null,{"$f":"IF(EV$2=1,Klimadaten!EV47,\"\")","v":""},null,null,null,{"$f":"IF(EZ$2=1,Klimadaten!EZ47,\"\")","v":""},null,null,null,{"$f":"IF(FD$2=1,Klimadaten!FD47,\"\")","v":""},null,null,null,{"$f":"IF(FH$2=1,Klimadaten!FH47,\"\")","v":""},null,null,null,{"$f":"IF(FL$2=1,Klimadaten!FL47,\"\")","v":""},null,null,null,{"$f":"IF(FP$2=1,Klimadaten!FP47,\"\")","v":""},null,null,null,{"$f":"IF(FT$2=1,Klimadaten!FT47,\"\")","v":""},null,null,null,{"$f":"IF(FX$2=1,Klimadaten!FX47,\"\")","v":""},null,null,null,{"$f":"IF(GB$2=1,Klimadaten!GB47,\"\")","v":""},null,null,null,{"$f":"IF(GF$2=1,Klimadaten!GF47,\"\")","v":""},null,null,null,{"$f":"IF(GJ$2=1,Klimadaten!GJ47,\"\")","v":""},null,null,null,{"$f":"IF(GN$2=1,Klimadaten!GN47,\"\")","v":""},null,null,null,{"$f":"IF(GR$2=1,Klimadaten!GR47,\"\")","v":""},null,null,null,{"$f":"IF(GV$2=1,Klimadaten!GV47,\"\")","v":""},null,null,null,{"$f":"IF(GZ$2=1,Klimadaten!GZ47,\"\")","v":""},null,null,null,{"$f":"IF(HD$2=1,Klimadaten!HD47,\"\")","v":""},null,null,null,{"$f":"IF(HH$2=1,Klimadaten!HH47,\"\")","v":""},null,null,null,{"$f":"IF(HL$2=1,Klimadaten!HL47,\"\")","v":""},null,null,null,{"$f":"IF(HP$2=1,Klimadaten!HP47,\"\")","v":""},null,null,null,{"$f":"IF(HT$2=1,Klimadaten!HT47,\"\")","v":""},null,null,null,{"$f":"IF(HX$2=1,Klimadaten!HX47,\"\")","v":""},null,null,null,{"$f":"IF(IB$2=1,Klimadaten!IB47,\"\")","v":15},null,null,null,{"$f":"IF(IF$2=1,Klimadaten!IF47,\"\")","v":""},null,null,null,{"$f":"IF(IJ$2=1,Klimadaten!IJ47,\"\")","v":""},null,null,null,{"$f":"IF(IN$2=1,Klimadaten!IN47,\"\")","v":""},null,null,null,{"$f":"IF(IR$2=1,Klimadaten!IR47,\"\")","v":""},null,null,null,{"$f":"IF(IV$2=1,Klimadaten!IV47,\"\")","v":""},null,null,null,{"$f":"IF(IZ$2=1,Klimadaten!IZ47,\"\")","v":""},null,null,null,{"$f":"IF(JD$2=1,Klimadaten!JD47,\"\")","v":""},null,null,null,{"$f":"IF(JH$2=1,Klimadaten!JH47,\"\")","v":""},null,null,null,{"$f":"IF(JL$2=1,Klimadaten!JL47,\"\")","v":""}]
[18,null,null,{"$f":"IF(D$2=1,Klimadaten!D48,\"\")","v":3},null,null,null,{"$f":"IF(H$2=1,Klimadaten!H48,\"\")","v":""},null,null,null,{"$f":"IF(L$2=1,Klimadaten!L48,\"\")","v":""},null,null,null,{"$f":"IF(P$2=1,Klimadaten!P48,\"\")","v":17},null,null,null,{"$f":"IF(T$2=1,Klimadaten!T48,\"\")","v":""},null,null,null,{"$f":"IF(X$2=1,Klimadaten!X48,\"\")","v":""},null,null,null,{"$f":"IF(AB$2=1,Klimadaten!AB48,\"\")","v":""},null,null,null,{"$f":"IF(AF$2=1,Klimadaten!AF48,\"\")","v":""},null,null,null,{"$f":"IF(AJ$2=1,Klimadaten!AJ48,\"\")","v":""},null,null,null,{"$f":"IF(AN$2=1,Klimadaten!AN48,\"\")","v":""},null,null,null,{"$f":"IF(AR$2=1,Klimadaten!AR48,\"\")","v":""},null,null,null,{"$f":"IF(AV$2=1,Klimadaten!AV48,\"\")","v":""},null,null,null,{"$f":"IF(AZ$2=1,Klimadaten!AZ48,\"\")","v":""},null,null,null,{"$f":"IF(BD$2=1,Klimadaten!BD48,\"\")","v":""},null,null,null,{"$f":"IF(BH$2=1,Klimadaten!BH48,\"\")","v":""},null,null,null,{"$f":"IF(BL$2=1,Klimadaten!BL48,\"\")","v":""},null,null,null,{"$f":"IF(BP$2=1,Klimadaten!BP48,\"\")","v":""},null,null,null,{"$f":"IF(BT$2=1,Klimadaten!BT48,\"\")","v":10},null,null,null,{"$f":"IF(BX$2=1,Klimadaten!BX48,\"\")","v":""},null,null,null,{"$f":"IF(CB$2=1,Klimadaten!CB48,\"\")","v":""},null,null,null,{"$f":"IF(CF$2=1,Klimadaten!CF48,\"\")","v":""},null,null,null,{"$f":"IF(CJ$2=1,Klimadaten!CJ48,\"\")","v":""},null,null,null,{"$f":"IF(CN$2=1,Klimadaten!CN48,\"\")","v":""},null,null,null,{"$f":"IF(CR$2=1,Klimadaten!CR48,\"\")","v":""},null,null,null,{"$f":"IF(CV$2=1,Klimadaten!CV48,\"\")","v":""},null,null,null,{"$f":"IF(CZ$2=1,Klimadaten!CZ48,\"\")","v":""},null,null,null,{"$f":"IF(DD$2=1,Klimadaten!DD48,\"\")","v":""},null,null,null,{"$f":"IF(DH$2=1,Klimadaten!DH48,\"\")","v":""},null,null,null,{"$f":"IF(DL$2=1,Klimadaten!DL48,\"\")","v":""},null,null,null,{"$f":"IF(DP$2=1,Klimadaten!DP48,\"\")","v":""},null,null,null,{"$f":"IF(DT$2=1,Klimadaten!DT48,\"\")","v":""},null,null,null,{"$f":"IF(DX$2=1,Klimadaten!DX48,\"\")","v":""},null,null,null,{"$f":"IF(EB$2=1,Klimadaten!EB48,\"\")","v":""},null,null,null,{"$f":"IF(EF$2=1,Klimadaten!EF48,\"\")","v":""},null,null,null,{"$f":"IF(EJ$2=1,Klimadaten!EJ48,\"\")","v":""},null,null,null,{"$f":"IF(EN$2=1,Klimadaten!EN48,\"\")","v":""},null,null,null,{"$f":"IF(ER$2=1,Klimadaten!ER48,\"\")","v":""},null,null,null,{"$f":"IF(EV$2=1,Klimadaten!EV48,\"\")","v":""},null,null,null,{"$f":"IF(EZ$2=1,Klimadaten!EZ48,\"\")","v":""},null,null,null,{"$f":"IF(FD$2=1,Klimadaten!FD48,\"\")","v":""},null,null,null,{"$f":"IF(FH$2=1,Klimadaten!FH48,\"\")","v":""},null,null,null,{"$f":"IF(FL$2=1,Klimadaten!FL48,\"\")","v":""},null,null,null,{"$f":"IF(FP$2=1,Klimadaten!FP48,\"\")","v":""},null,null,null,{"$f":"IF(FT$2=1,Klimadaten!FT48,\"\")","v":""},null,null,null,{"$f":"IF(FX$2=1,Klimadaten!FX48,\"\")","v":""},null,null,null,{"$f":"IF(GB$2=1,Klimadaten!GB48,\"\")","v":""},null,null,null,{"$f":"IF(GF$2=1,Klimadaten!GF48,\"\")","v":""},null,null,null,{"$f":"IF(GJ$2=1,Klimadaten!GJ48,\"\")","v":""},null,null,null,{"$f":"IF(GN$2=1,Klimadaten!GN48,\"\")","v":""},null,null,null,{"$f":"IF(GR$2=1,Klimadaten!GR48,\"\")","v":""},null,null,null,{"$f":"IF(GV$2=1,Klimadaten!GV48,\"\")","v":""},null,null,null,{"$f":"IF(GZ$2=1,Klimadaten!GZ48,\"\")","v":""},null,null,null,{"$f":"IF(HD$2=1,Klimadaten!HD48,\"\")","v":""},null,null,null,{"$f":"IF(HH$2=1,Klimadaten!HH48,\"\")","v":""},null,null,null,{"$f":"IF(HL$2=1,Klimadaten!HL48,\"\")","v":""},null,null,null,{"$f":"IF(HP$2=1,Klimadaten!HP48,\"\")","v":""},null,null,null,{"$f":"IF(HT$2=1,Klimadaten!HT48,\"\")","v":""},null,null,null,{"$f":"IF(HX$2=1,Klimadaten!HX48,\"\")","v":""},null,null,null,{"$f":"IF(IB$2=1,Klimadaten!IB48,\"\")","v":13},null,null,null,{"$f":"IF(IF$2=1,Klimadaten!IF48,\"\")","v":""},null,null,null,{"$f":"IF(IJ$2=1,Klimadaten!IJ48,\"\")","v":""},null,null,null,{"$f":"IF(IN$2=1,Klimadaten!IN48,\"\")","v":""},null,null,null,{"$f":"IF(IR$2=1,Klimadaten!IR48,\"\")","v":""},null,null,null,{"$f":"IF(IV$2=1,Klimadaten!IV48,\"\")","v":""},null,null,null,{"$f":"IF(IZ$2=1,Klimadaten!IZ48,\"\")","v":""},null,null,null,{"$f":"IF(JD$2=1,Klimadaten!JD48,\"\")","v":""},null,null,null,{"$f":"IF(JH$2=1,Klimadaten!JH48,\"\")","v":""},null,null,null,{"$f":"IF(JL$2=1,Klimadaten!JL48,\"\")","v":""}]
[19,null,null,{"$f":"IF(D$2=1,Klimadaten!D49,\"\")","v":2},null,null,null,{"$f":"IF(H$2=1,Klimadaten!H49,\"\")","v":""},null,null,null,{"$f":"IF(L$2=1,Klimadaten!L49,\"\")","v":""},null,null,null,{"$f":"IF(P$2=1,Klimadaten!P49,\"\")","v":15},null,null,null,{"$f":"IF(T$2=1,Klimadaten!T49,\"\")","v":""},null,null,null,{"$f":"IF(X$2=1,Klimadaten!X49,\"\")","v":""},null,null,null,{"$f":"IF(AB$2=1,Klimadaten!AB49,\"\")","v":""},null,null,null,{"$f":"IF(AF$2=1,Klimadaten!AF49,\"\")","v":""},null,null,null,{"$f":"IF(AJ$2=1,Klimadaten!AJ49,\"\")","v":""},null,null,null,{"$f":"IF(AN$2=1,Klimadaten!AN49,\"\")","v":""},null,null,null,{"$f":"IF(AR$2=1,Klimadaten!AR49,\"\")","v":""},null,null,null,{"$f":"IF(AV$2=1,Klimadaten!AV49,\"\")","v":""},null,null,null,{"$f":"IF(AZ$2=1,Klimadaten!AZ49,\"\")","v":""},null,null,null,{"$f":"IF(BD$2=1,Klimadaten!BD49,\"\")","v":""},null,null,null,{"$f":"IF(BH$2=1,Klimadaten!BH49,\"\")","v":""},null,null,null,{"$f":"IF(BL$2=1,Klimadaten!BL49,\"\")","v":""},null,null,null,{"$f":"IF(BP$2=1,Klimadaten!BP49,\"\")","v":""},null,null,null,{"$f":"IF(BT$2=1,Klimadaten!BT49,\"\")","v":9},null,null,null,{"$f":"IF(BX$2=1,Klimadaten!BX49,\"\")","v":""},null,null,null,{"$f":"IF(CB$2=1,Klimadaten!CB49,\"\")","v":""},null,null,null,{"$f":"IF(CF$2=1,Klimadaten!CF49,\"\")","v":""},null,null,null,{"$f":"IF(CJ$2=1,Klimadaten!CJ49,\"\")","v":""},null,null,null,{"$f":"IF(CN$2=1,Klimadaten!CN49,\"\")","v":""},null,null,null,{"$f":"IF(CR$2=1,Klimadaten!CR49,\"\")","v":""},null,null,null,{"$f":"IF(CV$2=1,Klimadaten!CV49,\"\")","v":""},null,null,null,{"$f":"IF(CZ$2=1,Klimadaten!CZ49,\"\")","v":""},null,null,null,{"$f":"IF(DD$2=1,Klimadaten!DD49,\"\")","v":""},null,null,null,{"$f":"IF(DH$2=1,Klimadaten!DH49,\"\")","v":""},null,null,null,{"$f":"IF(DL$2=1,Klimadaten!DL49,\"\")","v":""},null,null,null,{"$f":"IF(DP$2=1,Klimadaten!DP49,\"\")","v":""},null,null,null,{"$f":"IF(DT$2=1,Klimadaten!DT49,\"\")","v":""},null,null,null,{"$f":"IF(DX$2=1,Klimadaten!DX49,\"\")","v":""},null,null,null,{"$f":"IF(EB$2=1,Klimadaten!EB49,\"\")","v":""},null,null,null,{"$f":"IF(EF$2=1,Klimadaten!EF49,\"\")","v":""},null,null,null,{"$f":"IF(EJ$2=1,Klimadaten!EJ49,\"\")","v":""},null,null,null,{"$f":"IF(EN$2=1,Klimadaten!EN49,\"\")","v":""},null,null,null,{"$f":"IF(ER$2=1,Klimadaten!ER49,\"\")","v":""},null,null,null,{"$f":"IF(EV$2=1,Klimadaten!EV49,\"\")","v":""},null,null,null,{"$f":"IF(EZ$2=1,Klimadaten!EZ49,\"\")","v":""},null,null,null,{"$f":"IF(FD$2=1,Klimadaten!FD49,\"\")","v":""},null,null,null,{"$f":"IF(FH$2=1,Klimadaten!FH49,\"\")","v":""},null,null,null,{"$f":"IF(FL$2=1,Klimadaten!FL49,\"\")","v":""},null,null,null,{"$f":"IF(FP$2=1,Klimadaten!FP49,\"\")","v":""},null,null,null,{"$f":"IF(FT$2=1,Klimadaten!FT49,\"\")","v":""},null,null,null,{"$f":"IF(FX$2=1,Klimadaten!FX49,\"\")","v":""},null,null,null,{"$f":"IF(GB$2=1,Klimadaten!GB49,\"\")","v":""},null,null,null,{"$f":"IF(GF$2=1,Klimadaten!GF49,\"\")","v":""},null,null,null,{"$f":"IF(GJ$2=1,Klimadaten!GJ49,\"\")","v":""},null,null,null,{"$f":"IF(GN$2=1,Klimadaten!GN49,\"\")","v":""},null,null,null,{"$f":"IF(GR$2=1,Klimadaten!GR49,\"\")","v":""},null,null,null,{"$f":"IF(GV$2=1,Klimadaten!GV49,\"\")","v":""},null,null,null,{"$f":"IF(GZ$2=1,Klimadaten!GZ49,\"\")","v":""},null,null,null,{"$f":"IF(HD$2=1,Klimadaten!HD49,\"\")","v":""},null,null,null,{"$f":"IF(HH$2=1,Klimadaten!HH49,\"\")","v":""},null,null,null,{"$f":"IF(HL$2=1,Klimadaten!HL49,\"\")","v":""},null,null,null,{"$f":"IF(HP$2=1,Klimadaten!HP49,\"\")","v":""},null,null,null,{"$f":"IF(HT$2=1,Klimadaten!HT49,\"\")","v":""},null,null,null,{"$f":"IF(HX$2=1,Klimadaten!HX49,\"\")","v":""},null,null,null,{"$f":"IF(IB$2=1,Klimadaten!IB49,\"\")","v":15},null,null,null,{"$f":"IF(IF$2=1,Klimadaten!IF49,\"\")","v":""},null,null,null,{"$f":"IF(IJ$2=1,Klimadaten!IJ49,\"\")","v":""},null,null,null,{"$f":"IF(IN$2=1,Klimadaten!IN49,\"\")","v":""},null,null,null,{"$f":"IF(IR$2=1,Klimadaten!IR49,\"\")","v":""},null,null,null,{"$f":"IF(IV$2=1,Klimadaten!IV49,\"\")","v":""},null,null,null,{"$f":"IF(IZ$2=1,Klimadaten!IZ49,\"\")","v":""},null,null,null,{"$f":"IF(JD$2=1,Klimadaten!JD49,\"\")","v":""},null,null,null,{"$f":"IF(JH$2=1,Klimadaten!JH49,\"\")","v":""},null,null,null,{"$f":"IF(JL$2=1,Klimadaten!JL49,\"\")","v":""}]
[20,null,null,{"$f":"IF(D$2=1,Klimadaten!D50,\"\")","v":0},null,null,null,{"$f":"IF(H$2=1,Klimadaten!H50,\"\")","v":""},null,null,null,{"$f":"IF(L$2=1,Klimadaten!L50,\"\")","v":""},null,null,null,{"$f":"IF(P$2=1,Klimadaten!P50,\"\")","v":15},null,null,null,{"$f":"IF(T$2=1,Klimadaten!T50,\"\")","v":""},null,null,null,{"$f":"IF(X$2=1,Klimadaten!X50,\"\")","v":""},null,null,null,{"$f":"IF(AB$2=1,Klimadaten!AB50,\"\")","v":""},null,null,null,{"$f":"IF(AF$2=1,Klimadaten!AF50,\"\")","v":""},null,null,null,{"$f":"IF(AJ$2=1,Klimadaten!AJ50,\"\")","v":""},null,null,null,{"$f":"IF(AN$2=1,Klimadaten!AN50,\"\")","v":""},null,null,null,{"$f":"IF(AR$2=1,Klimadaten!AR50,\"\")","v":""},null,null,null,{"$f":"IF(AV$2=1,Klimadaten!AV50,\"\")","v":""},null,null,null,{"$f":"IF(AZ$2=1,Klimadaten!AZ50,\"\")","v":""},null,null,null,{"$f":"IF(BD$2=1,Klimadaten!BD50,\"\")","v":""},null,null,null,{"$f":"IF(BH$2=1,Klimadaten!BH50,\"\")","v":""},null,null,null,{"$f":"IF(BL$2=1,Klimadaten!BL50,\"\")","v":""},null,null,null,{"$f":"IF(BP$2=1,Klimadaten!BP50,\"\")","v":""},null,null,null,{"$f":"IF(BT$2=1,Klimadaten!BT50,\"\")","v":8},null,null,null,{"$f":"IF(BX$2=1,Klimadaten!BX50,\"\")","v":""},null,null,null,{"$f":"IF(CB$2=1,Klimadaten!CB50,\"\")","v":""},null,null,null,{"$f":"IF(CF$2=1,Klimadaten!CF50,\"\")","v":""},null,null,null,{"$f":"IF(CJ$2=1,Klimadaten!CJ50,\"\")","v":""},null,null,null,{"$f":"IF(CN$2=1,Klimadaten!CN50,\"\")","v":""},null,null,null,{"$f":"IF(CR$2=1,Klimadaten!CR50,\"\")","v":""},null,null,null,{"$f":"IF(CV$2=1,Klimadaten!CV50,\"\")","v":""},null,null,null,{"$f":"IF(CZ$2=1,Klimadaten!CZ50,\"\")","v":""},null,null,null,{"$f":"IF(DD$2=1,Klimadaten!DD50,\"\")","v":""},null,null,null,{"$f":"IF(DH$2=1,Klimadaten!DH50,\"\")","v":""},null,null,null,{"$f":"IF(DL$2=1,Klimadaten!DL50,\"\")","v":""},null,null,null,{"$f":"IF(DP$2=1,Klimadaten!DP50,\"\")","v":""},null,null,null,{"$f":"IF(DT$2=1,Klimadaten!DT50,\"\")","v":""},null,null,null,{"$f":"IF(DX$2=1,Klimadaten!DX50,\"\")","v":""},null,null,null,{"$f":"IF(EB$2=1,Klimadaten!EB50,\"\")","v":""},null,null,null,{"$f":"IF(EF$2=1,Klimadaten!EF50,\"\")","v":""},null,null,null,{"$f":"IF(EJ$2=1,Klimadaten!EJ50,\"\")","v":""},null,null,null,{"$f":"IF(EN$2=1,Klimadaten!EN50,\"\")","v":""},null,null,null,{"$f":"IF(ER$2=1,Klimadaten!ER50,\"\")","v":""},null,null,null,{"$f":"IF(EV$2=1,Klimadaten!EV50,\"\")","v":""},null,null,null,{"$f":"IF(EZ$2=1,Klimadaten!EZ50,\"\")","v":""},null,null,null,{"$f":"IF(FD$2=1,Klimadaten!FD50,\"\")","v":""},null,null,null,{"$f":"IF(FH$2=1,Klimadaten!FH50,\"\")","v":""},null,null,null,{"$f":"IF(FL$2=1,Klimadaten!FL50,\"\")","v":""},null,null,null,{"$f":"IF(FP$2=1,Klimadaten!FP50,\"\")","v":""},null,null,null,{"$f":"IF(FT$2=1,Klimadaten!FT50,\"\")","v":""},null,null,null,{"$f":"IF(FX$2=1,Klimadaten!FX50,\"\")","v":""},null,null,null,{"$f":"IF(GB$2=1,Klimadaten!GB50,\"\")","v":""},null,null,null,{"$f":"IF(GF$2=1,Klimadaten!GF50,\"\")","v":""},null,null,null,{"$f":"IF(GJ$2=1,Klimadaten!GJ50,\"\")","v":""},null,null,null,{"$f":"IF(GN$2=1,Klimadaten!GN50,\"\")","v":""},null,null,null,{"$f":"IF(GR$2=1,Klimadaten!GR50,\"\")","v":""},null,null,null,{"$f":"IF(GV$2=1,Klimadaten!GV50,\"\")","v":""},null,null,null,{"$f":"IF(GZ$2=1,Klimadaten!GZ50,\"\")","v":""},null,null,null,{"$f":"IF(HD$2=1,Klimadaten!HD50,\"\")","v":""},null,null,null,{"$f":"IF(HH$2=1,Klimadaten!HH50,\"\")","v":""},null,null,null,{"$f":"IF(HL$2=1,Klimadaten!HL50,\"\")","v":""},null,null,null,{"$f":"IF(HP$2=1,Klimadaten!HP50,\"\")","v":""},null,null,null,{"$f":"IF(HT$2=1,Klimadaten!HT50,\"\")","v":""},null,null,null,{"$f":"IF(HX$2=1,Klimadaten!HX50,\"\")","v":""},null,null,null,{"$f":"IF(IB$2=1,Klimadaten!IB50,\"\")","v":16},null,null,null,{"$f":"IF(IF$2=1,Klimadaten!IF50,\"\")","v":""},null,null,null,{"$f":"IF(IJ$2=1,Klimadaten!IJ50,\"\")","v":""},null,null,null,{"$f":"IF(IN$2=1,Klimadaten!IN50,\"\")","v":""},null,null,null,{"$f":"IF(IR$2=1,Klimadaten!IR50,\"\")","v":""},null,null,null,{"$f":"IF(IV$2=1,Klimadaten!IV50,\"\")","v":""},null,null,null,{"$f":"IF(IZ$2=1,Klimadaten!IZ50,\"\")","v":""},null,null,null,{"$f":"IF(JD$2=1,Klimadaten!JD50,\"\")","v":""},null,null,null,{"$f":"IF(JH$2=1,Klimadaten!JH50,\"\")","v":""},null,null,null,{"$f":"IF(JL$2=1,Klimadaten!JL50,\"\")","v":""}]
[21,null,null,{"$f":"IF(D$2=1,Klimadaten!D51,\"\")","v":0},null,null,null,{"$f":"IF(H$2=1,Klimadaten!H51,\"\")","v":""},null,null,null,{"$f":"IF(L$2=1,Klimadaten!L51,\"\")","v":""},null,null,null,{"$f":"IF(P$2=1,Klimadaten!P51,\"\")","v":13},null,null,null,{"$f":"IF(T$2=1,Klimadaten!T51,\"\")","v":""},null,null,null,{"$f":"IF(X$2=1,Klimadaten!X51,\"\")","v":""},null,null,null,{"$f":"IF(AB$2=1,Klimadaten!AB51,\"\")","v":""},null,null,null,{"$f":"IF(AF$2=1,Klimadaten!AF51,\"\")","v":""},null,null,null,{"$f":"IF(AJ$2=1,Klimadaten!AJ51,\"\")","v":""},null,null,null,{"$f":"IF(AN$2=1,Klimadaten!AN51,\"\")","v":""},null,null,null,{"$f":"IF(AR$2=1,Klimadaten!AR51,\"\")","v":""},null,null,null,{"$f":"IF(AV$2=1,Klimadaten!AV51,\"\")","v":""},null,null,null,{"$f":"IF(AZ$2=1,Klimadaten!AZ51,\"\")","v":""},null,null,null,{"$f":"IF(BD$2=1,Klimadaten!BD51,\"\")","v":""},null,null,null,{"$f":"IF(BH$2=1,Klimadaten!BH51,\"\")","v":""},null,null,null,{"$f":"IF(BL$2=1,Klimadaten!BL51,\"\")","v":""},null,null,null,{"$f":"IF(BP$2=1,Klimadaten!BP51,\"\")","v":""},null,null,null,{"$f":"IF(BT$2=1,Klimadaten!BT51,\"\")","v":4},null,null,null,{"$f":"IF(BX$2=1,Klimadaten!BX51,\"\")","v":""},null,null,null,{"$f":"IF(CB$2=1,Klimadaten!CB51,\"\")","v":""},null,null,null,{"$f":"IF(CF$2=1,Klimadaten!CF51,\"\")","v":""},null,null,null,{"$f":"IF(CJ$2=1,Klimadaten!CJ51,\"\")","v":""},null,null,null,{"$f":"IF(CN$2=1,Klimadaten!CN51,\"\")","v":""},null,null,null,{"$f":"IF(CR$2=1,Klimadaten!CR51,\"\")","v":""},null,null,null,{"$f":"IF(CV$2=1,Klimadaten!CV51,\"\")","v":""},null,null,null,{"$f":"IF(CZ$2=1,Klimadaten!CZ51,\"\")","v":""},null,null,null,{"$f":"IF(DD$2=1,Klimadaten!DD51,\"\")","v":""},null,null,null,{"$f":"IF(DH$2=1,Klimadaten!DH51,\"\")","v":""},null,null,null,{"$f":"IF(DL$2=1,Klimadaten!DL51,\"\")","v":""},null,null,null,{"$f":"IF(DP$2=1,Klimadaten!DP51,\"\")","v":""},null,null,null,{"$f":"IF(DT$2=1,Klimadaten!DT51,\"\")","v":""},null,null,null,{"$f":"IF(DX$2=1,Klimadaten!DX51,\"\")","v":""},null,null,null,{"$f":"IF(EB$2=1,Klimadaten!EB51,\"\")","v":""},null,null,null,{"$f":"IF(EF$2=1,Klimadaten!EF51,\"\")","v":""},null,null,null,{"$f":"IF(EJ$2=1,Klimadaten!EJ51,\"\")","v":""},null,null,null,{"$f":"IF(EN$2=1,Klimadaten!EN51,\"\")","v":""},null,null,null,{"$f":"IF(ER$2=1,Klimadaten!ER51,\"\")","v":""},null,null,null,{"$f":"IF(EV$2=1,Klimadaten!EV51,\"\")","v":""},null,null,null,{"$f":"IF(EZ$2=1,Klimadaten!EZ51,\"\")","v":""},null,null,null,{"$f":"IF(FD$2=1,Klimadaten!FD51,\"\")","v":""},null,null,null,{"$f":"IF(FH$2=1,Klimadaten!FH51,\"\")","v":""},null,null,null,{"$f":"IF(FL$2=1,Klimadaten!FL51,\"\")","v":""},null,null,null,{"$f":"IF(FP$2=1,Klimadaten!FP51,\"\")","v":""},null,null,null,{"$f":"IF(FT$2=1,Klimadaten!FT51,\"\")","v":""},null,null,null,{"$f":"IF(FX$2=1,Klimadaten!FX51,\"\")","v":""},null,null,null,{"$f":"IF(GB$2=1,Klimadaten!GB51,\"\")","v":""},null,null,null,{"$f":"IF(GF$2=1,Klimadaten!GF51,\"\")","v":""},null,null,null,{"$f":"IF(GJ$2=1,Klimadaten!GJ51,\"\")","v":""},null,null,null,{"$f":"IF(GN$2=1,Klimadaten!GN51,\"\")","v":""},null,null,null,{"$f":"IF(GR$2=1,Klimadaten!GR51,\"\")","v":""},null,null,null,{"$f":"IF(GV$2=1,Klimadaten!GV51,\"\")","v":""},null,null,null,{"$f":"IF(GZ$2=1,Klimadaten!GZ51,\"\")","v":""},null,null,null,{"$f":"IF(HD$2=1,Klimadaten!HD51,\"\")","v":""},null,null,null,{"$f":"IF(HH$2=1,Klimadaten!HH51,\"\")","v":""},null,null,null,{"$f":"IF(HL$2=1,Klimadaten!HL51,\"\")","v":""},null,null,null,{"$f":"IF(HP$2=1,Klimadaten!HP51,\"\")","v":""},null,null,null,{"$f":"IF(HT$2=1,Klimadaten!HT51,\"\")","v":""},null,null,null,{"$f":"IF(HX$2=1,Klimadaten!HX51,\"\")","v":""},null,null,null,{"$f":"IF(IB$2=1,Klimadaten!IB51,\"\")","v":15},null,null,null,{"$f":"IF(IF$2=1,Klimadaten!IF51,\"\")","v":""},null,null,null,{"$f":"IF(IJ$2=1,Klimadaten!IJ51,\"\")","v":""},null,null,null,{"$f":"IF(IN$2=1,Klimadaten!IN51,\"\")","v":""},null,null,null,{"$f":"IF(IR$2=1,Klimadaten!IR51,\"\")","v":""},null,null,null,{"$f":"IF(IV$2=1,Klimadaten!IV51,\"\")","v":""},null,null,null,{"$f":"IF(IZ$2=1,Klimadaten!IZ51,\"\")","v":""},null,null,null,{"$f":"IF(JD$2=1,Klimadaten!JD51,\"\")","v":""},null,null,null,{"$f":"IF(JH$2=1,Klimadaten!JH51,\"\")","v":""},null,null,null,{"$f":"IF(JL$2=1,Klimadaten!JL51,\"\")","v":""}]
[22,null,null,{"$f":"IF(D$2=1,Klimadaten!D52,\"\")","v":0},null,null,null,{"$f":"IF(H$2=1,Klimadaten!H52,\"\")","v":""},null,null,null,{"$f":"IF(L$2=1,Klimadaten!L52,\"\")","v":""},null,null,null,{"$f":"IF(P$2=1,Klimadaten!P52,\"\")","v":12},null,null,null,{"$f":"IF(T$2=1,Klimadaten!T52,\"\")","v":""},null,null,null,{"$f":"IF(X$2=1,Klimadaten!X52,\"\")","v":""},null,null,null,{"$f":"IF(AB$2=1,Klimadaten!AB52,\"\")","v":""},null,null,null,{"$f":"IF(AF$2=1,Klimadaten!AF52,\"\")","v":""},null,null,null,{"$f":"IF(AJ$2=1,Klimadaten!AJ52,\"\")","v":""},null,null,null,{"$f":"IF(AN$2=1,Klimadaten!AN52,\"\")","v":""},null,null,null,{"$f":"IF(AR$2=1,Klimadaten!AR52,\"\")","v":""},null,null,null,{"$f":"IF(AV$2=1,Klimadaten!AV52,\"\")","v":""},null,null,null,{"$f":"IF(AZ$2=1,Klimadaten!AZ52,\"\")","v":""},null,null,null,{"$f":"IF(BD$2=1,Klimadaten!BD52,\"\")","v":""},null,null,null,{"$f":"IF(BH$2=1,Klimadaten!BH52,\"\")","v":""},null,null,null,{"$f":"IF(BL$2=1,Klimadaten!BL52,\"\")","v":""},null,null,null,{"$f":"IF(BP$2=1,Klimadaten!BP52,\"\")","v":""},null,null,null,{"$f":"IF(BT$2=1,Klimadaten!BT52,\"\")","v":4},null,null,null,{"$f":"IF(BX$2=1,Klimadaten!BX52,\"\")","v":""},null,null,null,{"$f":"IF(CB$2=1,Klimadaten!CB52,\"\")","v":""},null,null,null,{"$f":"IF(CF$2=1,Klimadaten!CF52,\"\")","v":""},null,null,null,{"$f":"IF(CJ$2=1,Klimadaten!CJ52,\"\")","v":""},null,null,null,{"$f":"IF(CN$2=1,Klimadaten!CN52,\"\")","v":""},null,null,null,{"$f":"IF(CR$2=1,Klimadaten!CR52,\"\")","v":""},null,null,null,{"$f":"IF(CV$2=1,Klimadaten!CV52,\"\")","v":""},null,null,null,{"$f":"IF(CZ$2=1,Klimadaten!CZ52,\"\")","v":""},null,null,null,{"$f":"IF(DD$2=1,Klimadaten!DD52,\"\")","v":""},null,null,null,{"$f":"IF(DH$2=1,Klimadaten!DH52,\"\")","v":""},null,null,null,{"$f":"IF(DL$2=1,Klimadaten!DL52,\"\")","v":""},null,null,null,{"$f":"IF(DP$2=1,Klimadaten!DP52,\"\")","v":""},null,null,null,{"$f":"IF(DT$2=1,Klimadaten!DT52,\"\")","v":""},null,null,null,{"$f":"IF(DX$2=1,Klimadaten!DX52,\"\")","v":""},null,null,null,{"$f":"IF(EB$2=1,Klimadaten!EB52,\"\")","v":""},null,null,null,{"$f":"IF(EF$2=1,Klimadaten!EF52,\"\")","v":""},null,null,null,{"$f":"IF(EJ$2=1,Klimadaten!EJ52,\"\")","v":""},null,null,null,{"$f":"IF(EN$2=1,Klimadaten!EN52,\"\")","v":""},null,null,null,{"$f":"IF(ER$2=1,Klimadaten!ER52,\"\")","v":""},null,null,null,{"$f":"IF(EV$2=1,Klimadaten!EV52,\"\")","v":""},null,null,null,{"$f":"IF(EZ$2=1,Klimadaten!EZ52,\"\")","v":""},null,null,null,{"$f":"IF(FD$2=1,Klimadaten!FD52,\"\")","v":""},null,null,null,{"$f":"IF(FH$2=1,Klimadaten!FH52,\"\")","v":""},null,null,null,{"$f":"IF(FL$2=1,Klimadaten!FL52,\"\")","v":""},null,null,null,{"$f":"IF(FP$2=1,Klimadaten!FP52,\"\")","v":""},null,null,null,{"$f":"IF(FT$2=1,Klimadaten!FT52,\"\")","v":""},null,null,null,{"$f":"IF(FX$2=1,Klimadaten!FX52,\"\")","v":""},null,null,null,{"$f":"IF(GB$2=1,Klimadaten!GB52,\"\")","v":""},null,null,null,{"$f":"IF(GF$2=1,Klimadaten!GF52,\"\")","v":""},null,null,null,{"$f":"IF(GJ$2=1,Klimadaten!GJ52,\"\")","v":""},null,null,null,{"$f":"IF(GN$2=1,Klimadaten!GN52,\"\")","v":""},null,null,null,{"$f":"IF(GR$2=1,Klimadaten!GR52,\"\")","v":""},null,null,null,{"$f":"IF(GV$2=1,Klimadaten!GV52,\"\")","v":""},null,null,null,{"$f":"IF(GZ$2=1,Klimadaten!GZ52,\"\")","v":""},null,null,null,{"$f":"IF(HD$2=1,Klimadaten!HD52,\"\")","v":""},null,null,null,{"$f":"IF(HH$2=1,Klimadaten!HH52,\"\")","v":""},null,null,null,{"$f":"IF(HL$2=1,Klimadaten!HL52,\"\")","v":""},null,null,null,{"$f":"IF(HP$2=1,Klimadaten!HP52,\"\")","v":""},null,null,null,{"$f":"IF(HT$2=1,Klimadaten!HT52,\"\")","v":""},null,null,null,{"$f":"IF(HX$2=1,Klimadaten!HX52,\"\")","v":""},null,null,null,{"$f":"IF(IB$2=1,Klimadaten!IB52,\"\")","v":14},null,null,null,{"$f":"IF(IF$2=1,Klimadaten!IF52,\"\")","v":""},null,null,null,{"$f":"IF(IJ$2=1,Klimadaten!IJ52,\"\")","v":""},null,null,null,{"$f":"IF(IN$2=1,Klimadaten!IN52,\"\")","v":""},null,null,null,{"$f":"IF(IR$2=1,Klimadaten!IR52,\"\")","v":""},null,null,null,{"$f":"IF(IV$2=1,Klimadaten!IV52,\"\")","v":""},null,null,null,{"$f":"IF(IZ$2=1,Klimadaten!IZ52,\"\")","v":""},null,null,null,{"$f":"IF(JD$2=1,Klimadaten!JD52,\"\")","v":""},null,null,null,{"$f":"IF(JH$2=1,Klimadaten!JH52,\"\")","v":""},null,null,null,{"$f":"IF(JL$2=1,Klimadaten!JL52,\"\")","v":""}]
[23,null,null,{"$f":"IF(D$2=1,Klimadaten!D53,\"\")","v":0},null,null,null,{"$f":"IF(H$2=1,Klimadaten!H53,\"\")","v":""},null,null,null,{"$f":"IF(L$2=1,Klimadaten!L53,\"\")","v":""},null,null,null,{"$f":"IF(P$2=1,Klimadaten!P53,\"\")","v":7},null,null,null,{"$f":"IF(T$2=1,Klimadaten!T53,\"\")","v":""},null,null,null,{"$f":"IF(X$2=1,Klimadaten!X53,\"\")","v":""},null,null,null,{"$f":"IF(AB$2=1,Klimadaten!AB53,\"\")","v":""},null,null,null,{"$f":"IF(AF$2=1,Klimadaten!AF53,\"\")","v":""},null,null,null,{"$f":"IF(AJ$2=1,Klimadaten!AJ53,\"\")","v":""},null,null,null,{"$f":"IF(AN$2=1,Klimadaten!AN53,\"\")","v":""},null,null,null,{"$f":"IF(AR$2=1,Klimadaten!AR53,\"\")","v":""},null,null,null,{"$f":"IF(AV$2=1,Klimadaten!AV53,\"\")","v":""},null,null,null,{"$f":"IF(AZ$2=1,Klimadaten!AZ53,\"\")","v":""},null,null,null,{"$f":"IF(BD$2=1,Klimadaten!BD53,\"\")","v":""},null,null,null,{"$f":"IF(BH$2=1,Klimadaten!BH53,\"\")","v":""},null,null,null,{"$f":"IF(BL$2=1,Klimadaten!BL53,\"\")","v":""},null,null,null,{"$f":"IF(BP$2=1,Klimadaten!BP53,\"\")","v":""},null,null,null,{"$f":"IF(BT$2=1,Klimadaten!BT53,\"\")","v":2},null,null,null,{"$f":"IF(BX$2=1,Klimadaten!BX53,\"\")","v":""},null,null,null,{"$f":"IF(CB$2=1,Klimadaten!CB53,\"\")","v":""},null,null,null,{"$f":"IF(CF$2=1,Klimadaten!CF53,\"\")","v":""},null,null,null,{"$f":"IF(CJ$2=1,Klimadaten!CJ53,\"\")","v":""},null,null,null,{"$f":"IF(CN$2=1,Klimadaten!CN53,\"\")","v":""},null,null,null,{"$f":"IF(CR$2=1,Klimadaten!CR53,\"\")","v":""},null,null,null,{"$f":"IF(CV$2=1,Klimadaten!CV53,\"\")","v":""},null,null,null,{"$f":"IF(CZ$2=1,Klimadaten!CZ53,\"\")","v":""},null,null,null,{"$f":"IF(DD$2=1,Klimadaten!DD53,\"\")","v":""},null,null,null,{"$f":"IF(DH$2=1,Klimadaten!DH53,\"\")","v":""},null,null,null,{"$f":"IF(DL$2=1,Klimadaten!DL53,\"\")","v":""},null,null,null,{"$f":"IF(DP$2=1,Klimadaten!DP53,\"\")","v":""},null,null,null,{"$f":"IF(DT$2=1,Klimadaten!DT53,\"\")","v":""},null,null,null,{"$f":"IF(DX$2=1,Klimadaten!DX53,\"\")","v":""},null,null,null,{"$f":"IF(EB$2=1,Klimadaten!EB53,\"\")","v":""},null,null,null,{"$f":"IF(EF$2=1,Klimadaten!EF53,\"\")","v":""},null,null,null,{"$f":"IF(EJ$2=1,Klimadaten!EJ53,\"\")","v":""},null,null,null,{"$f":"IF(EN$2=1,Klimadaten!EN53,\"\")","v":""},null,null,null,{"$f":"IF(ER$2=1,Klimadaten!ER53,\"\")","v":""},null,null,null,{"$f":"IF(EV$2=1,Klimadaten!EV53,\"\")","v":""},null,null,null,{"$f":"IF(EZ$2=1,Klimadaten!EZ53,\"\")","v":""},null,null,null,{"$f":"IF(FD$2=1,Klimadaten!FD53,\"\")","v":""},null,null,null,{"$f":"IF(FH$2=1,Klimadaten!FH53,\"\")","v":""},null,null,null,{"$f":"IF(FL$2=1,Klimadaten!FL53,\"\")","v":""},null,null,null,{"$f":"IF(FP$2=1,Klimadaten!FP53,\"\")","v":""},null,null,null,{"$f":"IF(FT$2=1,Klimadaten!FT53,\"\")","v":""},null,null,null,{"$f":"IF(FX$2=1,Klimadaten!FX53,\"\")","v":""},null,null,null,{"$f":"IF(GB$2=1,Klimadaten!GB53,\"\")","v":""},null,null,null,{"$f":"IF(GF$2=1,Klimadaten!GF53,\"\")","v":""},null,null,null,{"$f":"IF(GJ$2=1,Klimadaten!GJ53,\"\")","v":""},null,null,null,{"$f":"IF(GN$2=1,Klimadaten!GN53,\"\")","v":""},null,null,null,{"$f":"IF(GR$2=1,Klimadaten!GR53,\"\")","v":""},null,null,null,{"$f":"IF(GV$2=1,Klimadaten!GV53,\"\")","v":""},null,null,null,{"$f":"IF(GZ$2=1,Klimadaten!GZ53,\"\")","v":""},null,null,null,{"$f":"IF(HD$2=1,Klimadaten!HD53,\"\")","v":""},null,null,null,{"$f":"IF(HH$2=1,Klimadaten!HH53,\"\")","v":""},null,null,null,{"$f":"IF(HL$2=1,Klimadaten!HL53,\"\")","v":""},null,null,null,{"$f":"IF(HP$2=1,Klimadaten!HP53,\"\")","v":""},null,null,null,{"$f":"IF(HT$2=1,Klimadaten!HT53,\"\")","v":""},null,null,null,{"$f":"IF(HX$2=1,Klimadaten!HX53,\"\")","v":""},null,null,null,{"$f":"IF(IB$2=1,Klimadaten!IB53,\"\")","v":15},null,null,null,{"$f":"IF(IF$2=1,Klimadaten!IF53,\"\")","v":""},null,null,null,{"$f":"IF(IJ$2=1,Klimadaten!IJ53,\"\")","v":""},null,null,null,{"$f":"IF(IN$2=1,Klimadaten!IN53,\"\")","v":""},null,null,null,{"$f":"IF(IR$2=1,Klimadaten!IR53,\"\")","v":""},null,null,null,{"$f":"IF(IV$2=1,Klimadaten!IV53,\"\")","v":""},null,null,null,{"$f":"IF(IZ$2=1,Klimadaten!IZ53,\"\")","v":""},null,null,null,{"$f":"IF(JD$2=1,Klimadaten!JD53,\"\")","v":""},null,null,null,{"$f":"IF(JH$2=1,Klimadaten!JH53,\"\")","v":""},null,null,null,{"$f":"IF(JL$2=1,Klimadaten!JL53,\"\")","v":""}]
[24,null,null,{"$f":"IF(D$2=1,Klimadaten!D54,\"\")","v":0},null,null,null,{"$f":"IF(H$2=1,Klimadaten!H54,\"\")","v":""},null,null,null,{"$f":"IF(L$2=1,Klimadaten!L54,\"\")","v":""},null,null,null,{"$f":"IF(P$2=1,Klimadaten!P54,\"\")","v":6},null,null,null,{"$f":"IF(T$2=1,Klimadaten!T54,\"\")","v":""},null,null,null,{"$f":"IF(X$2=1,Klimadaten!X54,\"\")","v":""},null,null,null,{"$f":"IF(AB$2=1,Klimadaten!AB54,\"\")","v":""},null,null,null,{"$f":"IF(AF$2=1,Klimadaten!AF54,\"\")","v":""},null,null,null,{"$f":"IF(AJ$2=1,Klimadaten!AJ54,\"\")","v":""},null,null,null,{"$f":"IF(AN$2=1,Klimadaten!AN54,\"\")","v":""},null,null,null,{"$f":"IF(AR$2=1,Klimadaten!AR54,\"\")","v":""},null,null,null,{"$f":"IF(AV$2=1,Klimadaten!AV54,\"\")","v":""},null,null,null,{"$f":"IF(AZ$2=1,Klimadaten!AZ54,\"\")","v":""},null,null,null,{"$f":"IF(BD$2=1,Klimadaten!BD54,\"\")","v":""},null,null,null,{"$f":"IF(BH$2=1,Klimadaten!BH54,\"\")","v":""},null,null,null,{"$f":"IF(BL$2=1,Klimadaten!BL54,\"\")","v":""},null,null,null,{"$f":"IF(BP$2=1,Klimadaten!BP54,\"\")","v":""},null,null,null,{"$f":"IF(BT$2=1,Klimadaten!BT54,\"\")","v":1},null,null,null,{"$f":"IF(BX$2=1,Klimadaten!BX54,\"\")","v":""},null,null,null,{"$f":"IF(CB$2=1,Klimadaten!CB54,\"\")","v":""},null,null,null,{"$f":"IF(CF$2=1,Klimadaten!CF54,\"\")","v":""},null,null,null,{"$f":"IF(CJ$2=1,Klimadaten!CJ54,\"\")","v":""},null,null,null,{"$f":"IF(CN$2=1,Klimadaten!CN54,\"\")","v":""},null,null,null,{"$f":"IF(CR$2=1,Klimadaten!CR54,\"\")","v":""},null,null,null,{"$f":"IF(CV$2=1,Klimadaten!CV54,\"\")","v":""},null,null,null,{"$f":"IF(CZ$2=1,Klimadaten!CZ54,\"\")","v":""},null,null,null,{"$f":"IF(DD$2=1,Klimadaten!DD54,\"\")","v":""},null,null,null,{"$f":"IF(DH$2=1,Klimadaten!DH54,\"\")","v":""},null,null,null,{"$f":"IF(DL$2=1,Klimadaten!DL54,\"\")","v":""},null,null,null,{"$f":"IF(DP$2=1,Klimadaten!DP54,\"\")","v":""},null,null,null,{"$f":"IF(DT$2=1,Klimadaten!DT54,\"\")","v":""},null,null,null,{"$f":"IF(DX$2=1,Klimadaten!DX54,\"\")","v":""},null,null,null,{"$f":"IF(EB$2=1,Klimadaten!EB54,\"\")","v":""},null,null,null,{"$f":"IF(EF$2=1,Klimadaten!EF54,\"\")","v":""},null,null,null,{"$f":"IF(EJ$2=1,Klimadaten!EJ54,\"\")","v":""},null,null,null,{"$f":"IF(EN$2=1,Klimadaten!EN54,\"\")","v":""},null,null,null,{"$f":"IF(ER$2=1,Klimadaten!ER54,\"\")","v":""},null,null,null,{"$f":"IF(EV$2=1,Klimadaten!EV54,\"\")","v":""},null,null,null,{"$f":"IF(EZ$2=1,Klimadaten!EZ54,\"\")","v":""},null,null,null,{"$f":"IF(FD$2=1,Klimadaten!FD54,\"\")","v":""},null,null,null,{"$f":"IF(FH$2=1,Klimadaten!FH54,\"\")","v":""},null,null,null,{"$f":"IF(FL$2=1,Klimadaten!FL54,\"\")","v":""},null,null,null,{"$f":"IF(FP$2=1,Klimadaten!FP54,\"\")","v":""},null,null,null,{"$f":"IF(FT$2=1,Klimadaten!FT54,\"\")","v":""},null,null,null,{"$f":"IF(FX$2=1,Klimadaten!FX54,\"\")","v":""},null,null,null,{"$f":"IF(GB$2=1,Klimadaten!GB54,\"\")","v":""},null,null,null,{"$f":"IF(GF$2=1,Klimadaten!GF54,\"\")","v":""},null,null,null,{"$f":"IF(GJ$2=1,Klimadaten!GJ54,\"\")","v":""},null,null,null,{"$f":"IF(GN$2=1,Klimadaten!GN54,\"\")","v":""},null,null,null,{"$f":"IF(GR$2=1,Klimadaten!GR54,\"\")","v":""},null,null,null,{"$f":"IF(GV$2=1,Klimadaten!GV54,\"\")","v":""},null,null,null,{"$f":"IF(GZ$2=1,Klimadaten!GZ54,\"\")","v":""},null,null,null,{"$f":"IF(HD$2=1,Klimadaten!HD54,\"\")","v":""},null,null,null,{"$f":"IF(HH$2=1,Klimadaten!HH54,\"\")","v":""},null,null,null,{"$f":"IF(HL$2=1,Klimadaten!HL54,\"\")","v":""},null,null,null,{"$f":"IF(HP$2=1,Klimadaten!HP54,\"\")","v":""},null,null,null,{"$f":"IF(HT$2=1,Klimadaten!HT54,\"\")","v":""},null,null,null,{"$f":"IF(HX$2=1,Klimadaten!HX54,\"\")","v":""},null,null,null,{"$f":"IF(IB$2=1,Klimadaten!IB54,\"\")","v":13},null,null,null,{"$f":"IF(IF$2=1,Klimadaten!IF54,\"\")","v":""},null,null,null,{"$f":"IF(IJ$2=1,Klimadaten!IJ54,\"\")","v":""},null,null,null,{"$f":"IF(IN$2=1,Klimadaten!IN54,\"\")","v":""},null,null,null,{"$f":"IF(IR$2=1,Klimadaten!IR54,\"\")","v":""},null,null,null,{"$f":"IF(IV$2=1,Klimadaten!IV54,\"\")","v":""},null,null,null,{"$f":"IF(IZ$2=1,Klimadaten!IZ54,\"\")","v":""},null,null,null,{"$f":"IF(JD$2=1,Klimadaten!JD54,\"\")","v":""},null,null,null,{"$f":"IF(JH$2=1,Klimadaten!JH54,\"\")","v":""},null,null,null,{"$f":"IF(JL$2=1,Klimadaten!JL54,\"\")","v":""}]
[25,null,null,{"$f":"IF(D$2=1,Klimadaten!D55,\"\")","v":0},null,null,null,{"$f":"IF(H$2=1,Klimadaten!H55,\"\")","v":""},null,null,null,{"$f":"IF(L$2=1,Klimadaten!L55,\"\")","v":""},null,null,null,{"$f":"IF(P$2=1,Klimadaten!P55,\"\")","v":3},null,null,null,{"$f":"IF(T$2=1,Klimadaten!T55,\"\")","v":""},null,null,null,{"$f":"IF(X$2=1,Klimadaten!X55,\"\")","v":""},null,null,null,{"$f":"IF(AB$2=1,Klimadaten!AB55,\"\")","v":""},null,null,null,{"$f":"IF(AF$2=1,Klimadaten!AF55,\"\")","v":""},null,null,null,{"$f":"IF(AJ$2=1,Klimadaten!AJ55,\"\")","v":""},null,null,null,{"$f":"IF(AN$2=1,Klimadaten!AN55,\"\")","v":""},null,null,null,{"$f":"IF(AR$2=1,Klimadaten!AR55,\"\")","v":""},null,null,null,{"$f":"IF(AV$2=1,Klimadaten!AV55,\"\")","v":""},null,null,null,{"$f":"IF(AZ$2=1,Klimadaten!AZ55,\"\")","v":""},null,null,null,{"$f":"IF(BD$2=1,Klimadaten!BD55,\"\")","v":""},null,null,null,{"$f":"IF(BH$2=1,Klimadaten!BH55,\"\")","v":""},null,null,null,{"$f":"IF(BL$2=1,Klimadaten!BL55,\"\")","v":""},null,null,null,{"$f":"IF(BP$2=1,Klimadaten!BP55,\"\")","v":""},null,null,null,{"$f":"IF(BT$2=1,Klimadaten!BT55,\"\")","v":1},null,null,null,{"$f":"IF(BX$2=1,Klimadaten!BX55,\"\")","v":""},null,null,null,{"$f":"IF(CB$2=1,Klimadaten!CB55,\"\")","v":""},null,null,null,{"$f":"IF(CF$2=1,Klimadaten!CF55,\"\")","v":""},null,null,null,{"$f":"IF(CJ$2=1,Klimadaten!CJ55,\"\")","v":""},null,null,null,{"$f":"IF(CN$2=1,Klimadaten!CN55,\"\")","v":""},null,null,null,{"$f":"IF(CR$2=1,Klimadaten!CR55,\"\")","v":""},null,null,null,{"$f":"IF(CV$2=1,Klimadaten!CV55,\"\")","v":""},null,null,null,{"$f":"IF(CZ$2=1,Klimadaten!CZ55,\"\")","v":""},null,null,null,{"$f":"IF(DD$2=1,Klimadaten!DD55,\"\")","v":""},null,null,null,{"$f":"IF(DH$2=1,Klimadaten!DH55,\"\")","v":""},null,null,null,{"$f":"IF(DL$2=1,Klimadaten!DL55,\"\")","v":""},null,null,null,{"$f":"IF(DP$2=1,Klimadaten!DP55,\"\")","v":""},null,null,null,{"$f":"IF(DT$2=1,Klimadaten!DT55,\"\")","v":""},null,null,null,{"$f":"IF(DX$2=1,Klimadaten!DX55,\"\")","v":""},null,null,null,{"$f":"IF(EB$2=1,Klimadaten!EB55,\"\")","v":""},null,null,null,{"$f":"IF(EF$2=1,Klimadaten!EF55,\"\")","v":""},null,null,null,{"$f":"IF(EJ$2=1,Klimadaten!EJ55,\"\")","v":""},null,null,null,{"$f":"IF(EN$2=1,Klimadaten!EN55,\"\")","v":""},null,null,null,{"$f":"IF(ER$2=1,Klimadaten!ER55,\"\")","v":""},null,null,null,{"$f":"IF(EV$2=1,Klimadaten!EV55,\"\")","v":""},null,null,null,{"$f":"IF(EZ$2=1,Klimadaten!EZ55,\"\")","v":""},null,null,null,{"$f":"IF(FD$2=1,Klimadaten!FD55,\"\")","v":""},null,null,null,{"$f":"IF(FH$2=1,Klimadaten!FH55,\"\")","v":""},null,null,null,{"$f":"IF(FL$2=1,Klimadaten!FL55,\"\")","v":""},null,null,null,{"$f":"IF(FP$2=1,Klimadaten!FP55,\"\")","v":""},null,null,null,{"$f":"IF(FT$2=1,Klimadaten!FT55,\"\")","v":""},null,null,null,{"$f":"IF(FX$2=1,Klimadaten!FX55,\"\")","v":""},null,null,null,{"$f":"IF(GB$2=1,Klimadaten!GB55,\"\")","v":""},null,null,null,{"$f":"IF(GF$2=1,Klimadaten!GF55,\"\")","v":""},null,null,null,{"$f":"IF(GJ$2=1,Klimadaten!GJ55,\"\")","v":""},null,null,null,{"$f":"IF(GN$2=1,Klimadaten!GN55,\"\")","v":""},null,null,null,{"$f":"IF(GR$2=1,Klimadaten!GR55,\"\")","v":""},null,null,null,{"$f":"IF(GV$2=1,Klimadaten!GV55,\"\")","v":""},null,null,null,{"$f":"IF(GZ$2=1,Klimadaten!GZ55,\"\")","v":""},null,null,null,{"$f":"IF(HD$2=1,Klimadaten!HD55,\"\")","v":""},null,null,null,{"$f":"IF(HH$2=1,Klimadaten!HH55,\"\")","v":""},null,null,null,{"$f":"IF(HL$2=1,Klimadaten!HL55,\"\")","v":""},null,null,null,{"$f":"IF(HP$2=1,Klimadaten!HP55,\"\")","v":""},null,null,null,{"$f":"IF(HT$2=1,Klimadaten!HT55,\"\")","v":""},null,null,null,{"$f":"IF(HX$2=1,Klimadaten!HX55,\"\")","v":""},null,null,null,{"$f":"IF(IB$2=1,Klimadaten!IB55,\"\")","v":11},null,null,null,{"$f":"IF(IF$2=1,Klimadaten!IF55,\"\")","v":""},null,null,null,{"$f":"IF(IJ$2=1,Klimadaten!IJ55,\"\")","v":""},null,null,null,{"$f":"IF(IN$2=1,Klimadaten!IN55,\"\")","v":""},null,null,null,{"$f":"IF(IR$2=1,Klimadaten!IR55,\"\")","v":""},null,null,null,{"$f":"IF(IV$2=1,Klimadaten!IV55,\"\")","v":""},null,null,null,{"$f":"IF(IZ$2=1,Klimadaten!IZ55,\"\")","v":""},null,null,null,{"$f":"IF(JD$2=1,Klimadaten!JD55,\"\")","v":""},null,null,null,{"$f":"IF(JH$2=1,Klimadaten!JH55,\"\")","v":""},null,null,null,{"$f":"IF(JL$2=1,Klimadaten!JL55,\"\")","v":""}]
[26,null,null,{"$f":"IF(D$2=1,Klimadaten!D56,\"\")","v":0},null,null,null,{"$f":"IF(H$2=1,Klimadaten!H56,\"\")","v":""},null,null,null,{"$f":"IF(L$2=1,Klimadaten!L56,\"\")","v":""},null,null,null,{"$f":"IF(P$2=1,Klimadaten!P56,\"\")","v":3},null,null,null,{"$f":"IF(T$2=1,Klimadaten!T56,\"\")","v":""},null,null,null,{"$f":"IF(X$2=1,Klimadaten!X56,\"\")","v":""},null,null,null,{"$f":"IF(AB$2=1,Klimadaten!AB56,\"\")","v":""},null,null,null,{"$f":"IF(AF$2=1,Klimadaten!AF56,\"\")","v":""},null,null,null,{"$f":"IF(AJ$2=1,Klimadaten!AJ56,\"\")","v":""},null,null,null,{"$f":"IF(AN$2=1,Klimadaten!AN56,\"\")","v":""},null,null,null,{"$f":"IF(AR$2=1,Klimadaten!AR56,\"\")","v":""},null,null,null,{"$f":"IF(AV$2=1,Klimadaten!AV56,\"\")","v":""},null,null,null,{"$f":"IF(AZ$2=1,Klimadaten!AZ56,\"\")","v":""},null,null,null,{"$f":"IF(BD$2=1,Klimadaten!BD56,\"\")","v":""},null,null,null,{"$f":"IF(BH$2=1,Klimadaten!BH56,\"\")","v":""},null,null,null,{"$f":"IF(BL$2=1,Klimadaten!BL56,\"\")","v":""},null,null,null,{"$f":"IF(BP$2=1,Klimadaten!BP56,\"\")","v":""},null,null,null,{"$f":"IF(BT$2=1,Klimadaten!BT56,\"\")","v":0},null,null,null,{"$f":"IF(BX$2=1,Klimadaten!BX56,\"\")","v":""},null,null,null,{"$f":"IF(CB$2=1,Klimadaten!CB56,\"\")","v":""},null,null,null,{"$f":"IF(CF$2=1,Klimadaten!CF56,\"\")","v":""},null,null,null,{"$f":"IF(CJ$2=1,Klimadaten!CJ56,\"\")","v":""},null,null,null,{"$f":"IF(CN$2=1,Klimadaten!CN56,\"\")","v":""},null,null,null,{"$f":"IF(CR$2=1,Klimadaten!CR56,\"\")","v":""},null,null,null,{"$f":"IF(CV$2=1,Klimadaten!CV56,\"\")","v":""},null,null,null,{"$f":"IF(CZ$2=1,Klimadaten!CZ56,\"\")","v":""},null,null,null,{"$f":"IF(DD$2=1,Klimadaten!DD56,\"\")","v":""},null,null,null,{"$f":"IF(DH$2=1,Klimadaten!DH56,\"\")","v":""},null,null,null,{"$f":"IF(DL$2=1,Klimadaten!DL56,\"\")","v":""},null,null,null,{"$f":"IF(DP$2=1,Klimadaten!DP56,\"\")","v":""},null,null,null,{"$f":"IF(DT$2=1,Klimadaten!DT56,\"\")","v":""},null,null,null,{"$f":"IF(DX$2=1,Klimadaten!DX56,\"\")","v":""},null,null,null,{"$f":"IF(EB$2=1,Klimadaten!EB56,\"\")","v":""},null,null,null,{"$f":"IF(EF$2=1,Klimadaten!EF56,\"\")","v":""},null,null,null,{"$f":"IF(EJ$2=1,Klimadaten!EJ56,\"\")","v":""},null,null,null,{"$f":"IF(EN$2=1,Klimadaten!EN56,\"\")","v":""},null,null,null,{"$f":"IF(ER$2=1,Klimadaten!ER56,\"\")","v":""},null,null,null,{"$f":"IF(EV$2=1,Klimadaten!EV56,\"\")","v":""},null,null,null,{"$f":"IF(EZ$2=1,Klimadaten!EZ56,\"\")","v":""},null,null,null,{"$f":"IF(FD$2=1,Klimadaten!FD56,\"\")","v":""},null,null,null,{"$f":"IF(FH$2=1,Klimadaten!FH56,\"\")","v":""},null,null,null,{"$f":"IF(FL$2=1,Klimadaten!FL56,\"\")","v":""},null,null,null,{"$f":"IF(FP$2=1,Klimadaten!FP56,\"\")","v":""},null,null,null,{"$f":"IF(FT$2=1,Klimadaten!FT56,\"\")","v":""},null,null,null,{"$f":"IF(FX$2=1,Klimadaten!FX56,\"\")","v":""},null,null,null,{"$f":"IF(GB$2=1,Klimadaten!GB56,\"\")","v":""},null,null,null,{"$f":"IF(GF$2=1,Klimadaten!GF56,\"\")","v":""},null,null,null,{"$f":"IF(GJ$2=1,Klimadaten!GJ56,\"\")","v":""},null,null,null,{"$f":"IF(GN$2=1,Klimadaten!GN56,\"\")","v":""},null,null,null,{"$f":"IF(GR$2=1,Klimadaten!GR56,\"\")","v":""},null,null,null,{"$f":"IF(GV$2=1,Klimadaten!GV56,\"\")","v":""},null,null,null,{"$f":"IF(GZ$2=1,Klimadaten!GZ56,\"\")","v":""},null,null,null,{"$f":"IF(HD$2=1,Klimadaten!HD56,\"\")","v":""},null,null,null,{"$f":"IF(HH$2=1,Klimadaten!HH56,\"\")","v":""},null,null,null,{"$f":"IF(HL$2=1,Klimadaten!HL56,\"\")","v":""},null,null,null,{"$f":"IF(HP$2=1,Klimadaten!HP56,\"\")","v":""},null,null,null,{"$f":"IF(HT$2=1,Klimadaten!HT56,\"\")","v":""},null,null,null,{"$f":"IF(HX$2=1,Klimadaten!HX56,\"\")","v":""},null,null,null,{"$f":"IF(IB$2=1,Klimadaten!IB56,\"\")","v":6},null,null,null,{"$f":"IF(IF$2=1,Klimadaten!IF56,\"\")","v":""},null,null,null,{"$f":"IF(IJ$2=1,Klimadaten!IJ56,\"\")","v":""},null,null,null,{"$f":"IF(IN$2=1,Klimadaten!IN56,\"\")","v":""},null,null,null,{"$f":"IF(IR$2=1,Klimadaten!IR56,\"\")","v":""},null,null,null,{"$f":"IF(IV$2=1,Klimadaten!IV56,\"\")","v":""},null,null,null,{"$f":"IF(IZ$2=1,Klimadaten!IZ56,\"\")","v":""},null,null,null,{"$f":"IF(JD$2=1,Klimadaten!JD56,\"\")","v":""},null,null,null,{"$f":"IF(JH$2=1,Klimadaten!JH56,\"\")","v":""},null,null,null,{"$f":"IF(JL$2=1,Klimadaten!JL56,\"\")","v":""}]
[27,null,null,{"$f":"IF(D$2=1,Klimadaten!D57,\"\")","v":0},null,null,null,{"$f":"IF(H$2=1,Klimadaten!H57,\"\")","v":""},null,null,null,{"$f":"IF(L$2=1,Klimadaten!L57,\"\")","v":""},null,null,null,{"$f":"IF(P$2=1,Klimadaten!P57,\"\")","v":0},null,null,null,{"$f":"IF(T$2=1,Klimadaten!T57,\"\")","v":""},null,null,null,{"$f":"IF(X$2=1,Klimadaten!X57,\"\")","v":""},null,null,null,{"$f":"IF(AB$2=1,Klimadaten!AB57,\"\")","v":""},null,null,null,{"$f":"IF(AF$2=1,Klimadaten!AF57,\"\")","v":""},null,null,null,{"$f":"IF(AJ$2=1,Klimadaten!AJ57,\"\")","v":""},null,null,null,{"$f":"IF(AN$2=1,Klimadaten!AN57,\"\")","v":""},null,null,null,{"$f":"IF(AR$2=1,Klimadaten!AR57,\"\")","v":""},null,null,null,{"$f":"IF(AV$2=1,Klimadaten!AV57,\"\")","v":""},null,null,null,{"$f":"IF(AZ$2=1,Klimadaten!AZ57,\"\")","v":""},null,null,null,{"$f":"IF(BD$2=1,Klimadaten!BD57,\"\")","v":""},null,null,null,{"$f":"IF(BH$2=1,Klimadaten!BH57,\"\")","v":""},null,null,null,{"$f":"IF(BL$2=1,Klimadaten!BL57,\"\")","v":""},null,null,null,{"$f":"IF(BP$2=1,Klimadaten!BP57,\"\")","v":""},null,null,null,{"$f":"IF(BT$2=1,Klimadaten!BT57,\"\")","v":0},null,null,null,{"$f":"IF(BX$2=1,Klimadaten!BX57,\"\")","v":""},null,null,null,{"$f":"IF(CB$2=1,Klimadaten!CB57,\"\")","v":""},null,null,null,{"$f":"IF(CF$2=1,Klimadaten!CF57,\"\")","v":""},null,null,null,{"$f":"IF(CJ$2=1,Klimadaten!CJ57,\"\")","v":""},null,null,null,{"$f":"IF(CN$2=1,Klimadaten!CN57,\"\")","v":""},null,null,null,{"$f":"IF(CR$2=1,Klimadaten!CR57,\"\")","v":""},null,null,null,{"$f":"IF(CV$2=1,Klimadaten!CV57,\"\")","v":""},null,null,null,{"$f":"IF(CZ$2=1,Klimadaten!CZ57,\"\")","v":""},null,null,null,{"$f":"IF(DD$2=1,Klimadaten!DD57,\"\")","v":""},null,null,null,{"$f":"IF(DH$2=1,Klimadaten!DH57,\"\")","v":""},null,null,null,{"$f":"IF(DL$2=1,Klimadaten!DL57,\"\")","v":""},null,null,null,{"$f":"IF(DP$2=1,Klimadaten!DP57,\"\")","v":""},null,null,null,{"$f":"IF(DT$2=1,Klimadaten!DT57,\"\")","v":""},null,null,null,{"$f":"IF(DX$2=1,Klimadaten!DX57,\"\")","v":""},null,null,null,{"$f":"IF(EB$2=1,Klimadaten!EB57,\"\")","v":""},null,null,null,{"$f":"IF(EF$2=1,Klimadaten!EF57,\"\")","v":""},null,null,null,{"$f":"IF(EJ$2=1,Klimadaten!EJ57,\"\")","v":""},null,null,null,{"$f":"IF(EN$2=1,Klimadaten!EN57,\"\")","v":""},null,null,null,{"$f":"IF(ER$2=1,Klimadaten!ER57,\"\")","v":""},null,null,null,{"$f":"IF(EV$2=1,Klimadaten!EV57,\"\")","v":""},null,null,null,{"$f":"IF(EZ$2=1,Klimadaten!EZ57,\"\")","v":""},null,null,null,{"$f":"IF(FD$2=1,Klimadaten!FD57,\"\")","v":""},null,null,null,{"$f":"IF(FH$2=1,Klimadaten!FH57,\"\")","v":""},null,null,null,{"$f":"IF(FL$2=1,Klimadaten!FL57,\"\")","v":""},null,null,null,{"$f":"IF(FP$2=1,Klimadaten!FP57,\"\")","v":""},null,null,null,{"$f":"IF(FT$2=1,Klimadaten!FT57,\"\")","v":""},null,null,null,{"$f":"IF(FX$2=1,Klimadaten!FX57,\"\")","v":""},null,null,null,{"$f":"IF(GB$2=1,Klimadaten!GB57,\"\")","v":""},null,null,null,{"$f":"IF(GF$2=1,Klimadaten!GF57,\"\")","v":""},null,null,null,{"$f":"IF(GJ$2=1,Klimadaten!GJ57,\"\")","v":""},null,null,null,{"$f":"IF(GN$2=1,Klimadaten!GN57,\"\")","v":""},null,null,null,{"$f":"IF(GR$2=1,Klimadaten!GR57,\"\")","v":""},null,null,null,{"$f":"IF(GV$2=1,Klimadaten!GV57,\"\")","v":""},null,null,null,{"$f":"IF(GZ$2=1,Klimadaten!GZ57,\"\")","v":""},null,null,null,{"$f":"IF(HD$2=1,Klimadaten!HD57,\"\")","v":""},null,null,null,{"$f":"IF(HH$2=1,Klimadaten!HH57,\"\")","v":""},null,null,null,{"$f":"IF(HL$2=1,Klimadaten!HL57,\"\")","v":""},null,null,null,{"$f":"IF(HP$2=1,Klimadaten!HP57,\"\")","v":""},null,null,null,{"$f":"IF(HT$2=1,Klimadaten!HT57,\"\")","v":""},null,null,null,{"$f":"IF(HX$2=1,Klimadaten!HX57,\"\")","v":""},null,null,null,{"$f":"IF(IB$2=1,Klimadaten!IB57,\"\")","v":4},null,null,null,{"$f":"IF(IF$2=1,Klimadaten!IF57,\"\")","v":""},null,null,null,{"$f":"IF(IJ$2=1,Klimadaten!IJ57,\"\")","v":""},null,null,null,{"$f":"IF(IN$2=1,Klimadaten!IN57,\"\")","v":""},null,null,null,{"$f":"IF(IR$2=1,Klimadaten!IR57,\"\")","v":""},null,null,null,{"$f":"IF(IV$2=1,Klimadaten!IV57,\"\")","v":""},null,null,null,{"$f":"IF(IZ$2=1,Klimadaten!IZ57,\"\")","v":""},null,null,null,{"$f":"IF(JD$2=1,Klimadaten!JD57,\"\")","v":""},null,null,null,{"$f":"IF(JH$2=1,Klimadaten!JH57,\"\")","v":""},null,null,null,{"$f":"IF(JL$2=1,Klimadaten!JL57,\"\")","v":""}]
[28,null,null,{"$f":"IF(D$2=1,Klimadaten!D58,\"\")","v":0},null,null,null,{"$f":"IF(H$2=1,Klimadaten!H58,\"\")","v":""},null,null,null,{"$f":"IF(L$2=1,Klimadaten!L58,\"\")","v":""},null,null,null,{"$f":"IF(P$2=1,Klimadaten!P58,\"\")","v":0},null,null,null,{"$f":"IF(T$2=1,Klimadaten!T58,\"\")","v":""},null,null,null,{"$f":"IF(X$2=1,Klimadaten!X58,\"\")","v":""},null,null,null,{"$f":"IF(AB$2=1,Klimadaten!AB58,\"\")","v":""},null,null,null,{"$f":"IF(AF$2=1,Klimadaten!AF58,\"\")","v":""},null,null,null,{"$f":"IF(AJ$2=1,Klimadaten!AJ58,\"\")","v":""},null,null,null,{"$f":"IF(AN$2=1,Klimadaten!AN58,\"\")","v":""},null,null,null,{"$f":"IF(AR$2=1,Klimadaten!AR58,\"\")","v":""},null,null,null,{"$f":"IF(AV$2=1,Klimadaten!AV58,\"\")","v":""},null,null,null,{"$f":"IF(AZ$2=1,Klimadaten!AZ58,\"\")","v":""},null,null,null,{"$f":"IF(BD$2=1,Klimadaten!BD58,\"\")","v":""},null,null,null,{"$f":"IF(BH$2=1,Klimadaten!BH58,\"\")","v":""},null,null,null,{"$f":"IF(BL$2=1,Klimadaten!BL58,\"\")","v":""},null,null,null,{"$f":"IF(BP$2=1,Klimadaten!BP58,\"\")","v":""},null,null,null,{"$f":"IF(BT$2=1,Klimadaten!BT58,\"\")","v":0},null,null,null,{"$f":"IF(BX$2=1,Klimadaten!BX58,\"\")","v":""},null,null,null,{"$f":"IF(CB$2=1,Klimadaten!CB58,\"\")","v":""},null,null,null,{"$f":"IF(CF$2=1,Klimadaten!CF58,\"\")","v":""},null,null,null,{"$f":"IF(CJ$2=1,Klimadaten!CJ58,\"\")","v":""},null,null,null,{"$f":"IF(CN$2=1,Klimadaten!CN58,\"\")","v":""},null,null,null,{"$f":"IF(CR$2=1,Klimadaten!CR58,\"\")","v":""},null,null,null,{"$f":"IF(CV$2=1,Klimadaten!CV58,\"\")","v":""},null,null,null,{"$f":"IF(CZ$2=1,Klimadaten!CZ58,\"\")","v":""},null,null,null,{"$f":"IF(DD$2=1,Klimadaten!DD58,\"\")","v":""},null,null,null,{"$f":"IF(DH$2=1,Klimadaten!DH58,\"\")","v":""},null,null,null,{"$f":"IF(DL$2=1,Klimadaten!DL58,\"\")","v":""},null,null,null,{"$f":"IF(DP$2=1,Klimadaten!DP58,\"\")","v":""},null,null,null,{"$f":"IF(DT$2=1,Klimadaten!DT58,\"\")","v":""},null,null,null,{"$f":"IF(DX$2=1,Klimadaten!DX58,\"\")","v":""},null,null,null,{"$f":"IF(EB$2=1,Klimadaten!EB58,\"\")","v":""},null,null,null,{"$f":"IF(EF$2=1,Klimadaten!EF58,\"\")","v":""},null,null,null,{"$f":"IF(EJ$2=1,Klimadaten!EJ58,\"\")","v":""},null,null,null,{"$f":"IF(EN$2=1,Klimadaten!EN58,\"\")","v":""},null,null,null,{"$f":"IF(ER$2=1,Klimadaten!ER58,\"\")","v":""},null,null,null,{"$f":"IF(EV$2=1,Klimadaten!EV58,\"\")","v":""},null,null,null,{"$f":"IF(EZ$2=1,Klimadaten!EZ58,\"\")","v":""},null,null,null,{"$f":"IF(FD$2=1,Klimadaten!FD58,\"\")","v":""},null,null,null,{"$f":"IF(FH$2=1,Klimadaten!FH58,\"\")","v":""},null,null,null,{"$f":"IF(FL$2=1,Klimadaten!FL58,\"\")","v":""},null,null,null,{"$f":"IF(FP$2=1,Klimadaten!FP58,\"\")","v":""},null,null,null,{"$f":"IF(FT$2=1,Klimadaten!FT58,\"\")","v":""},null,null,null,{"$f":"IF(FX$2=1,Klimadaten!FX58,\"\")","v":""},null,null,null,{"$f":"IF(GB$2=1,Klimadaten!GB58,\"\")","v":""},null,null,null,{"$f":"IF(GF$2=1,Klimadaten!GF58,\"\")","v":""},null,null,null,{"$f":"IF(GJ$2=1,Klimadaten!GJ58,\"\")","v":""},null,null,null,{"$f":"IF(GN$2=1,Klimadaten!GN58,\"\")","v":""},null,null,null,{"$f":"IF(GR$2=1,Klimadaten!GR58,\"\")","v":""},null,null,null,{"$f":"IF(GV$2=1,Klimadaten!GV58,\"\")","v":""},null,null,null,{"$f":"IF(GZ$2=1,Klimadaten!GZ58,\"\")","v":""},null,null,null,{"$f":"IF(HD$2=1,Klimadaten!HD58,\"\")","v":""},null,null,null,{"$f":"IF(HH$2=1,Klimadaten!HH58,\"\")","v":""},null,null,null,{"$f":"IF(HL$2=1,Klimadaten!HL58,\"\")","v":""},null,null,null,{"$f":"IF(HP$2=1,Klimadaten!HP58,\"\")","v":""},null,null,null,{"$f":"IF(HT$2=1,Klimadaten!HT58,\"\")","v":""},null,null,null,{"$f":"IF(HX$2=1,Klimadaten!HX58,\"\")","v":""},null,null,null,{"$f":"IF(IB$2=1,Klimadaten!IB58,\"\")","v":2},null,null,null,{"$f":"IF(IF$2=1,Klimadaten!IF58,\"\")","v":""},null,null,null,{"$f":"IF(IJ$2=1,Klimadaten!IJ58,\"\")","v":""},null,null,null,{"$f":"IF(IN$2=1,Klimadaten!IN58,\"\")","v":""},null,null,null,{"$f":"IF(IR$2=1,Klimadaten!IR58,\"\")","v":""},null,null,null,{"$f":"IF(IV$2=1,Klimadaten!IV58,\"\")","v":""},null,null,null,{"$f":"IF(IZ$2=1,Klimadaten!IZ58,\"\")","v":""},null,null,null,{"$f":"IF(JD$2=1,Klimadaten!JD58,\"\")","v":""},null,null,null,{"$f":"IF(JH$2=1,Klimadaten!JH58,\"\")","v":""},null,null,null,{"$f":"IF(JL$2=1,Klimadaten!JL58,\"\")","v":""}]
[29,null,null,{"$f":"IF(D$2=1,Klimadaten!D59,\"\")","v":0},null,null,null,{"$f":"IF(H$2=1,Klimadaten!H59,\"\")","v":""},null,null,null,{"$f":"IF(L$2=1,Klimadaten!L59,\"\")","v":""},null,null,null,{"$f":"IF(P$2=1,Klimadaten!P59,\"\")","v":0},null,null,null,{"$f":"IF(T$2=1,Klimadaten!T59,\"\")","v":""},null,null,null,{"$f":"IF(X$2=1,Klimadaten!X59,\"\")","v":""},null,null,null,{"$f":"IF(AB$2=1,Klimadaten!AB59,\"\")","v":""},null,null,null,{"$f":"IF(AF$2=1,Klimadaten!AF59,\"\")","v":""},null,null,null,{"$f":"IF(AJ$2=1,Klimadaten!AJ59,\"\")","v":""},null,null,null,{"$f":"IF(AN$2=1,Klimadaten!AN59,\"\")","v":""},null,null,null,{"$f":"IF(AR$2=1,Klimadaten!AR59,\"\")","v":""},null,null,null,{"$f":"IF(AV$2=1,Klimadaten!AV59,\"\")","v":""},null,null,null,{"$f":"IF(AZ$2=1,Klimadaten!AZ59,\"\")","v":""},null,null,null,{"$f":"IF(BD$2=1,Klimadaten!BD59,\"\")","v":""},null,null,null,{"$f":"IF(BH$2=1,Klimadaten!BH59,\"\")","v":""},null,null,null,{"$f":"IF(BL$2=1,Klimadaten!BL59,\"\")","v":""},null,null,null,{"$f":"IF(BP$2=1,Klimadaten!BP59,\"\")","v":""},null,null,null,{"$f":"IF(BT$2=1,Klimadaten!BT59,\"\")","v":0},null,null,null,{"$f":"IF(BX$2=1,Klimadaten!BX59,\"\")","v":""},null,null,null,{"$f":"IF(CB$2=1,Klimadaten!CB59,\"\")","v":""},null,null,null,{"$f":"IF(CF$2=1,Klimadaten!CF59,\"\")","v":""},null,null,null,{"$f":"IF(CJ$2=1,Klimadaten!CJ59,\"\")","v":""},null,null,null,{"$f":"IF(CN$2=1,Klimadaten!CN59,\"\")","v":""},null,null,null,{"$f":"IF(CR$2=1,Klimadaten!CR59,\"\")","v":""},null,null,null,{"$f":"IF(CV$2=1,Klimadaten!CV59,\"\")","v":""},null,null,null,{"$f":"IF(CZ$2=1,Klimadaten!CZ59,\"\")","v":""},null,null,null,{"$f":"IF(DD$2=1,Klimadaten!DD59,\"\")","v":""},null,null,null,{"$f":"IF(DH$2=1,Klimadaten!DH59,\"\")","v":""},null,null,null,{"$f":"IF(DL$2=1,Klimadaten!DL59,\"\")","v":""},null,null,null,{"$f":"IF(DP$2=1,Klimadaten!DP59,\"\")","v":""},null,null,null,{"$f":"IF(DT$2=1,Klimadaten!DT59,\"\")","v":""},null,null,null,{"$f":"IF(DX$2=1,Klimadaten!DX59,\"\")","v":""},null,null,null,{"$f":"IF(EB$2=1,Klimadaten!EB59,\"\")","v":""},null,null,null,{"$f":"IF(EF$2=1,Klimadaten!EF59,\"\")","v":""},null,null,null,{"$f":"IF(EJ$2=1,Klimadaten!EJ59,\"\")","v":""},null,null,null,{"$f":"IF(EN$2=1,Klimadaten!EN59,\"\")","v":""},null,null,null,{"$f":"IF(ER$2=1,Klimadaten!ER59,\"\")","v":""},null,null,null,{"$f":"IF(EV$2=1,Klimadaten!EV59,\"\")","v":""},null,null,null,{"$f":"IF(EZ$2=1,Klimadaten!EZ59,\"\")","v":""},null,null,null,{"$f":"IF(FD$2=1,Klimadaten!FD59,\"\")","v":""},null,null,null,{"$f":"IF(FH$2=1,Klimadaten!FH59,\"\")","v":""},null,null,null,{"$f":"IF(FL$2=1,Klimadaten!FL59,\"\")","v":""},null,null,null,{"$f":"IF(FP$2=1,Klimadaten!FP59,\"\")","v":""},null,null,null,{"$f":"IF(FT$2=1,Klimadaten!FT59,\"\")","v":""},null,null,null,{"$f":"IF(FX$2=1,Klimadaten!FX59,\"\")","v":""},null,null,null,{"$f":"IF(GB$2=1,Klimadaten!GB59,\"\")","v":""},null,null,null,{"$f":"IF(GF$2=1,Klimadaten!GF59,\"\")","v":""},null,null,null,{"$f":"IF(GJ$2=1,Klimadaten!GJ59,\"\")","v":""},null,null,null,{"$f":"IF(GN$2=1,Klimadaten!GN59,\"\")","v":""},null,null,null,{"$f":"IF(GR$2=1,Klimadaten!GR59,\"\")","v":""},null,null,null,{"$f":"IF(GV$2=1,Klimadaten!GV59,\"\")","v":""},null,null,null,{"$f":"IF(GZ$2=1,Klimadaten!GZ59,\"\")","v":""},null,null,null,{"$f":"IF(HD$2=1,Klimadaten!HD59,\"\")","v":""},null,null,null,{"$f":"IF(HH$2=1,Klimadaten!HH59,\"\")","v":""},null,null,null,{"$f":"IF(HL$2=1,Klimadaten!HL59,\"\")","v":""},null,null,null,{"$f":"IF(HP$2=1,Klimadaten!HP59,\"\")","v":""},null,null,null,{"$f":"IF(HT$2=1,Klimadaten!HT59,\"\")","v":""},null,null,null,{"$f":"IF(HX$2=1,Klimadaten!HX59,\"\")","v":""},null,null,null,{"$f":"IF(IB$2=1,Klimadaten!IB59,\"\")","v":0},null,null,null,{"$f":"IF(IF$2=1,Klimadaten!IF59,\"\")","v":""},null,null,null,{"$f":"IF(IJ$2=1,Klimadaten!IJ59,\"\")","v":""},null,null,null,{"$f":"IF(IN$2=1,Klimadaten!IN59,\"\")","v":""},null,null,null,{"$f":"IF(IR$2=1,Klimadaten!IR59,\"\")","v":""},null,null,null,{"$f":"IF(IV$2=1,Klimadaten!IV59,\"\")","v":""},null,null,null,{"$f":"IF(IZ$2=1,Klimadaten!IZ59,\"\")","v":""},null,null,null,{"$f":"IF(JD$2=1,Klimadaten!JD59,\"\")","v":""},null,null,null,{"$f":"IF(JH$2=1,Klimadaten!JH59,\"\")","v":""},null,null,null,{"$f":"IF(JL$2=1,Klimadaten!JL59,\"\")","v":""}]
[30,null,null,{"$f":"IF(D$2=1,Klimadaten!D60,\"\")","v":0},null,null,null,{"$f":"IF(H$2=1,Klimadaten!H60,\"\")","v":""},null,null,null,{"$f":"IF(L$2=1,Klimadaten!L60,\"\")","v":""},null,null,null,{"$f":"IF(P$2=1,Klimadaten!P60,\"\")","v":0},null,null,null,{"$f":"IF(T$2=1,Klimadaten!T60,\"\")","v":""},null,null,null,{"$f":"IF(X$2=1,Klimadaten!X60,\"\")","v":""},null,null,null,{"$f":"IF(AB$2=1,Klimadaten!AB60,\"\")","v":""},null,null,null,{"$f":"IF(AF$2=1,Klimadaten!AF60,\"\")","v":""},null,null,null,{"$f":"IF(AJ$2=1,Klimadaten!AJ60,\"\")","v":""},null,null,null,{"$f":"IF(AN$2=1,Klimadaten!AN60,\"\")","v":""},null,null,null,{"$f":"IF(AR$2=1,Klimadaten!AR60,\"\")","v":""},null,null,null,{"$f":"IF(AV$2=1,Klimadaten!AV60,\"\")","v":""},null,null,null,{"$f":"IF(AZ$2=1,Klimadaten!AZ60,\"\")","v":""},null,null,null,{"$f":"IF(BD$2=1,Klimadaten!BD60,\"\")","v":""},null,null,null,{"$f":"IF(BH$2=1,Klimadaten!BH60,\"\")","v":""},null,null,null,{"$f":"IF(BL$2=1,Klimadaten!BL60,\"\")","v":""},null,null,null,{"$f":"IF(BP$2=1,Klimadaten!BP60,\"\")","v":""},null,null,null,{"$f":"IF(BT$2=1,Klimadaten!BT60,\"\")","v":0},null,null,null,{"$f":"IF(BX$2=1,Klimadaten!BX60,\"\")","v":""},null,null,null,{"$f":"IF(CB$2=1,Klimadaten!CB60,\"\")","v":""},null,null,null,{"$f":"IF(CF$2=1,Klimadaten!CF60,\"\")","v":""},null,null,null,{"$f":"IF(CJ$2=1,Klimadaten!CJ60,\"\")","v":""},null,null,null,{"$f":"IF(CN$2=1,Klimadaten!CN60,\"\")","v":""},null,null,null,{"$f":"IF(CR$2=1,Klimadaten!CR60,\"\")","v":""},null,null,null,{"$f":"IF(CV$2=1,Klimadaten!CV60,\"\")","v":""},null,null,null,{"$f":"IF(CZ$2=1,Klimadaten!CZ60,\"\")","v":""},null,null,null,{"$f":"IF(DD$2=1,Klimadaten!DD60,\"\")","v":""},null,null,null,{"$f":"IF(DH$2=1,Klimadaten!DH60,\"\")","v":""},null,null,null,{"$f":"IF(DL$2=1,Klimadaten!DL60,\"\")","v":""},null,null,null,{"$f":"IF(DP$2=1,Klimadaten!DP60,\"\")","v":""},null,null,null,{"$f":"IF(DT$2=1,Klimadaten!DT60,\"\")","v":""},null,null,null,{"$f":"IF(DX$2=1,Klimadaten!DX60,\"\")","v":""},null,null,null,{"$f":"IF(EB$2=1,Klimadaten!EB60,\"\")","v":""},null,null,null,{"$f":"IF(EF$2=1,Klimadaten!EF60,\"\")","v":""},null,null,null,{"$f":"IF(EJ$2=1,Klimadaten!EJ60,\"\")","v":""},null,null,null,{"$f":"IF(EN$2=1,Klimadaten!EN60,\"\")","v":""},null,null,null,{"$f":"IF(ER$2=1,Klimadaten!ER60,\"\")","v":""},null,null,null,{"$f":"IF(EV$2=1,Klimadaten!EV60,\"\")","v":""},null,null,null,{"$f":"IF(EZ$2=1,Klimadaten!EZ60,\"\")","v":""},null,null,null,{"$f":"IF(FD$2=1,Klimadaten!FD60,\"\")","v":""},null,null,null,{"$f":"IF(FH$2=1,Klimadaten!FH60,\"\")","v":""},null,null,null,{"$f":"IF(FL$2=1,Klimadaten!FL60,\"\")","v":""},null,null,null,{"$f":"IF(FP$2=1,Klimadaten!FP60,\"\")","v":""},null,null,null,{"$f":"IF(FT$2=1,Klimadaten!FT60,\"\")","v":""},null,null,null,{"$f":"IF(FX$2=1,Klimadaten!FX60,\"\")","v":""},null,null,null,{"$f":"IF(GB$2=1,Klimadaten!GB60,\"\")","v":""},null,null,null,{"$f":"IF(GF$2=1,Klimadaten!GF60,\"\")","v":""},null,null,null,{"$f":"IF(GJ$2=1,Klimadaten!GJ60,\"\")","v":""},null,null,null,{"$f":"IF(GN$2=1,Klimadaten!GN60,\"\")","v":""},null,null,null,{"$f":"IF(GR$2=1,Klimadaten!GR60,\"\")","v":""},null,null,null,{"$f":"IF(GV$2=1,Klimadaten!GV60,\"\")","v":""},null,null,null,{"$f":"IF(GZ$2=1,Klimadaten!GZ60,\"\")","v":""},null,null,null,{"$f":"IF(HD$2=1,Klimadaten!HD60,\"\")","v":""},null,null,null,{"$f":"IF(HH$2=1,Klimadaten!HH60,\"\")","v":""},null,null,null,{"$f":"IF(HL$2=1,Klimadaten!HL60,\"\")","v":""},null,null,null,{"$f":"IF(HP$2=1,Klimadaten!HP60,\"\")","v":""},null,null,null,{"$f":"IF(HT$2=1,Klimadaten!HT60,\"\")","v":""},null,null,null,{"$f":"IF(HX$2=1,Klimadaten!HX60,\"\")","v":""},null,null,null,{"$f":"IF(IB$2=1,Klimadaten!IB60,\"\")","v":0},null,null,null,{"$f":"IF(IF$2=1,Klimadaten!IF60,\"\")","v":""},null,null,null,{"$f":"IF(IJ$2=1,Klimadaten!IJ60,\"\")","v":""},null,null,null,{"$f":"IF(IN$2=1,Klimadaten!IN60,\"\")","v":""},null,null,null,{"$f":"IF(IR$2=1,Klimadaten!IR60,\"\")","v":""},null,null,null,{"$f":"IF(IV$2=1,Klimadaten!IV60,\"\")","v":""},null,null,null,{"$f":"IF(IZ$2=1,Klimadaten!IZ60,\"\")","v":""},null,null,null,{"$f":"IF(JD$2=1,Klimadaten!JD60,\"\")","v":""},null,null,null,{"$f":"IF(JH$2=1,Klimadaten!JH60,\"\")","v":""},null,null,null,{"$f":"IF(JL$2=1,Klimadaten!JL60,\"\")","v":""}]

{"sheet":"Q-Plan Tabelle","index":12,"n_rows":56,"n_cols":7,"rows_kept":56,"cut":false,"hidden":false,"merged":[[8,1,8,4]]}
[]
[{"$f":"Text!C125","v":"    Unité monétaire:                                   Combustible:"},null,null,null,null,null,{"$f":"Text!C177","v":"Prédéfinition de la monnaie et le type de carburant"}]
[{"$f":"Verbraucher!A3","v":"Projet/Variante:"},{"$f":"IF(Verbraucher!B3=\"\",\"\",Verbraucher!B3)","v":"Exemple modèle (ligne 1)"}]
[null,{"$f":"IF(Verbraucher!B4=\"\",\"\",Verbraucher!B4)","v":"Exemple modèle (ligne 2)"}]
[null,{"$f":"IF(Verbraucher!B5=\"\",\"\",Verbraucher!B5)","v":"Exemple modèle (ligne 3)"}]
[{"$f":"Verbraucher!A6","v":"Saisi par: "},{"$f":"IF(Verbraucher!B6=\"\",\"\",Verbraucher!B6)","v":"Concepteur modèle"}]
[{"$f":"Verbraucher!A7","v":"Date:"},{"$f":"IF(Verbraucher!B7=\"\",\"\",Verbraucher!B7)","v":"2022-02-18"}]
[{"$f":"Text!C126","v":"Tableau Excel «Plan QM»"},null,null,null,null,null,{"$f":"Text!C178","v":"Calcul basé ou un exemple de valeur d'entrée dans la colonne \"Planification\":"}]
[{"$f":"Text!C127","v":"Nom du projet ou projet No"},{"$f":"Verbraucher!B3","v":"Exemple modèle (ligne 1)"},null,null,null,null,{"$f":"Text!C179","v":"Texte de la cellule B3 'Consommateurs'"}]
[null,null,null,{"$f":"Text!C128","v":"Planification"},{"$f":"Text!C129","v":"État réel EP5"}]
[]
[{"$f":"Text!C130","v":"Bilan énergétique de tous leur preneurs de chaleur"},null,"MWh/a",{"$f":"Hilfsblatt!I4+Hilfsblatt!I5+Hilfsblatt!I6","v":3933}]
[{"$f":"Text!C131","v":"          dont ceux raccordés au réseau"},null,"MWh/a",{"$f":"D12","v":3933},null,null,{"$f":"Text!C181","v":"Valeur d'entrée; entrée possible de Formule"}]
[{"$f":"Text!C132","v":"Pertes thermiques du réseau de chaleur"},null,"MWh/a",{"$f":"Hilfsblatt!I7","v":432.6}]
[{"$f":"Text!C133","v":"Bilan énergétique global (y compris pertes du réseau de chaleur)"},null,"MWh/a",{"$f":"D12+D14","v":4365.6000000000004},{"$f":"E12+E14","v":0},null,{"$f":"TEXT(Text!C183,0)&\" \"&\"D12+D14\"","v":"Valeur calculée: D12+D14"}]
[]
[{"$f":"Text!C134","v":"Puissance thermique de tous les preneurs de chaleur"},null,"kW",{"$f":"'Allgemeine Angaben'!C34","v":1722.5},null,null,{"$f":"Text!C184","v":"Valeur de la planification de la feuille Excel 'Informations generales'"}]
[{"$f":"Text!C135","v":"          dont ceux raccordés au réseau"},null,"kW",{"$f":"D17","v":1722.5},null,null,{"$f":"Text!C185","v":"valeur sélectionnable; entrée possible de Formule"}]
[{"$f":"Text!C136","v":"Pertes de puissance du réseau de chaleur"},null,"kW",{"$f":"'Allgemeine Angaben'!C22","v":49.4},null,null,{"$f":"Text!C186","v":"Valeur de la planification de la feuille Excel 'Informations generales'"}]
[{"$f":"Text!C137","v":"Puissance thermique globale de la production de chaleur"},null,"kW",{"$f":"D17+D19","v":1771.9},{"$f":"E17+E19","v":0},null,{"$f":"TEXT(Text!C183,0)&\" \"&\"D17+D19\"","v":"Valeur calculée: D17+D19"}]
[]
[{"$f":"Text!C138","v":"Longueur de fouilles du réseau de chaleur (y compris branchements d'immeubles)"},null,{"$f":"Text!C173","v":"mF"},null,null,null,{"$f":"Text!C187","v":"Valeur d'entrée; entrée possible de Formule"}]
[]
[{"$f":"Text!C139","v":"Puissance nominale de la (des) chaudière(s) à bois avec combustible de référence"},null,"kW",{"$f":"Wärmezentrale!K15","v":1450},null,null,{"$f":"Text!C188","v":"Valeur de la planification de la feuille Excel 'CentralThermique'"}]
[{"$f":"Text!C140","v":"Puissance nominale de la production de chaleur avec d'autres vecteurs énergétiques…......"},null,"kW",{"$f":"Wärmezentrale!K16","v":0},null,null,{"$f":"Text!C189","v":"Valeur de la planification de la feuille Excel 'CentralThermique'"}]
[{"$f":"Text!C141","v":"Total puissance nominale de la production de chaleur"},null,"kW",{"$f":"D25+D24","v":1450},{"$f":"E25+E24","v":0},null,{"$f":"TEXT(Text!C183,0)&\" \"&\"D24+D25\"","v":"Valeur calculée: D24+D25"}]
[]
[{"$f":"Text!C142","v":"Part de l'énergie produite avec du bois"},null,"%",{"$f":"Hilfsblatt!L15","v":100.00017221248707}]
[{"$f":"Text!C143","v":"Énergie produite avec du bois"},null,"MWh/a",{"$f":"D28*D15/100","v":4365.6075181083361},{"$f":"E28*E15/100","v":0},null,{"$f":"TEXT(Text!C183,0)&\" \"&\"D28*D15/100\"","v":"Valeur calculée: D28*D15/100"}]
[{"$f":"Text!C144","v":"Volume net du silo"},null,"m3",{"$f":"D32*D31/100","v":0},{"$f":"E32*E31/100","v":0},null,{"$f":"TEXT(Text!C183,0)&\" \"&\"D32*D31/100\"","v":"Valeur calculée: D32*D31/100"}]
[{"$f":"Text!C145","v":"Taux de remplissage du silo"},null,"%",null,null,null,{"$f":"Text!C191","v":"Valeur d'entrée; entrée possible de Formule"}]
[{"$f":"Text!C146","v":"Volume brut du silo"},null,"m3",null,null,null,{"$f":"Text!C192","v":"Valeur d'entrée; entrée possible de Formule"}]
[{"$f":"IF(Hilfsblatt!V2=1,Text!C147,Text!C148)","v":"Pouvoir calorifique par mètre cube de plaquettes"},null,{"$f":"IF(Hilfsblatt!V2=1,Text!C171,\"kWh/kg\")","v":"kWh/m3pl"},null,null,null,{"$f":"Text!C193","v":"Valeur d'entrée; entrée possible de Formule"}]
[{"$f":"Text!C149","v":"Consommation annuelle de combustible"},null,{"$f":"IF(Hilfsblatt!V2=1,Text!C172,\"kg\")","v":"m3pl"},{"$f":"D29*1000/(D33*0.85)","v":{"$error":"#DIV/0!"}},{"$f":"E29*1000/(E33*0.85)","v":{"$error":"#DIV/0!"}},null,{"$f":"TEXT(Text!C183,0)&\" \"&\"D29*1000/(D33*0.85)\"&TEXT(Text!C198,0)","v":"Valeur calculée: D29*1000/(D33*0.85); bois d'efficacité annuel chaudiéres 85%"}]
[]
[{"$f":"Text!C150","v":"Coûts"}]
[{"$f":"Text!C151","v":"Coûts d'investissements pour la production de chaleur"},null,{"$f":"IF(Hilfsblatt!U2=1,\"CHF\",\"€\")","v":"CHF"},null,null,null,{"$f":"Text!C194","v":"Valeur d'entrée; entrée possible de Formule"}]
[{"$f":"Text!C152","v":"Coûts d'investissements pour le réseau de chaleur"},null,{"$f":"IF(Hilfsblatt!U2=1,\"CHF\",\"€\")","v":"CHF"},null,null,null,{"$f":"Text!C195","v":"Valeur d'entrée; entrée possible de Formule"}]
[]
[{"$f":"Text!C153","v":"Données de température au point de dimensionnement"}]
[{"$f":"Text!C154","v":"Température départ principal réseau à distance au point de mesure"},null,"0C",null,null,null,{"$f":"Text!C196","v":"Valeur d'entrée; entrée possible de Formule"}]
[{"$f":"Text!C155","v":"Température retour principal réseau à distance au point de mesure"},null,"0C",null,null,null,{"$f":"Text!C197","v":"Valeur d'entrée; entrée possible de Formule"}]
[]
[{"$f":"Text!C156","v":"Caractéristiques"},{"$f":"Text!C157","v":"convenue"}]
[null,{"$f":"Text!C158","v":"resp. valeur"}]
[{"$f":"Text!C159","v":"E.2.6 Nombre d'heures de fonctionnement à pleine charge\ndes preneurs de chaleur"},null,"h/a",{"$f":"1000*D12/D17","v":2283.309143686502},{"$f":"1000*E12/E17","v":{"$error":"#DIV/0!"}},null,{"$f":"TEXT(Text!C183,0)&\" \"&\"1000*D12/D17\"","v":"Valeur calculée: 1000*D12/D17"}]
[{"$f":"Text!C160","v":"E.3.3 Densité de raccordement du réseau de chaleur"},"> 2.0",{"$f":"Text!C174","v":"MWh/(a mF)"},{"$f":"D13/D22","v":{"$error":"#DIV/0!"}},{"$f":"E13/E22","v":{"$error":"#DIV/0!"}},null,{"$f":"TEXT(Text!C183,0)&\" \"&\"D13/D22\"","v":"Valeur calculée: D13/D22"}]
[{"$f":"Text!C161","v":"E.3.3Pertes thermiques du réseau (% de la chaleur fournie)"},"< 10","%",{"$f":"D14*100/(D13+D14)","v":9.9092908191313906},{"$f":"(E14*100)/(E13+E14)","v":{"$error":"#DIV/0!"}},null,{"$f":"TEXT(Text!C183,0)&\" \"&\"D14*100/(D13+D14)\"","v":"Valeur calculée: D14*100/(D13+D14)"}]
[{"$f":"Text!C162","v":"         Coûts de la distribution de chaleur par mètre de fouille"},null,{"$f":"IF(Hilfsblatt!U2=1,Text!C175,Text!C176)","v":"CHF/mF"},{"$f":"D38/D22","v":{"$error":"#DIV/0!"}},{"$f":"E38/E22","v":{"$error":"#DIV/0!"}},null,{"$f":"TEXT(Text!C183,0)&\" \"&\"D38/D22\"","v":"Valeur calculée: D38/D22"}]
[{"$f":"Text!C163","v":"E.3.3 Coûts d'investissements spécifiques du réseau de chaleur"},null,{"$f":"IF(Hilfsblatt!U2=1,\"CHF/(MWh/a)\",\"€/(MWh/a)\")","v":"CHF/(MWh/a)"},{"$f":"D38/D13","v":0},{"$f":"E38/E13","v":{"$error":"#DIV/0!"}},null,{"$f":"TEXT(Text!C183,0)&\" \"&\"D38/D13\"","v":"Valeur calculée: D38/D13"}]
[{"$f":"Text!C164","v":"E.4.10 Coûts d'investissements spécifiques de la production de chaleur"},null,{"$f":"IF(Hilfsblatt!U2=1,\"CHF/kW\",\"€/kW\")","v":"CHF/kW"},{"$f":"D37/D20","v":0},{"$f":"E37/E20","v":{"$error":"#DIV/0!"}},null,{"$f":"TEXT(Text!C183,0)&\" \"&\"D37/D20\"","v":"Valeur calculée: D37/D20"}]
[{"$f":"Text!C165","v":"E.4.4 Nombre d'heures de fonctionnement à pleine charge\nde la (des) chaudière(s) à bois"},{"$f":"Wärmezentrale!L27","v":2000},"h/a",{"$f":"1000*D29/D24","v":3010.763805591956},{"$f":"1000*E29/E24","v":{"$error":"#DIV/0!"}},null,{"$f":"TEXT(Text!C183,0)&\" \"&\"1000*D29/D24\"","v":"Valeur calculée: 1000*D29/D24"}]
[{"$f":"Text!C166","v":"E.4.6 Nombre d'heures de fonctionnement à pleine charge d'autres \nproducteurs de chaleur"},null,"h/a",{"$f":"1000*(D15-D29)/D25","v":{"$error":"#DIV/0!"}},{"$f":"1000*(E15-E29)/E25","v":{"$error":"#DIV/0!"}},null,{"$f":"TEXT(Text!C183,0)&\" \"&\"1000*(D15-D29)/D25\"","v":"Valeur calculée: 1000*(D15-D29)/D25"}]
[{"$f":"IF(Hilfsblatt!V2=1,Text!C167,Text!C168)","v":"E.4.5 Volume du silo: Couverture des besoins à pleine charge en nombre de jours (+30 m3pl)"},{"$f":"IF(Hilfsblatt!V2=1,\"5-7\",\"–\")","v":"5-7"},{"$f":"Text!C170","v":"Jours"},{"$f":"IF(Hilfsblatt!V2=1,(D30-30)*D33*0.85/(D24*24),D30*(D33*650)*0.85/(D24*24))","v":0},{"$f":"((E30-30)*E33*0.85)/(E24*24)","v":{"$error":"#DIV/0!"}},null,{"$f":"TEXT(Text!C183,0)&\" \"&IF(Hilfsblatt!V2=1,\"(D30-30)*D33*0.85/(D24*24)\",\"D30*(D33*650)*0.85/(D24*24)\")&TEXT(Text!C198,0)","v":"Valeur calculée: (D30-30)*D33*0.85/(D24*24); bois d'efficacité annuel chaudiéres 85%"}]
[null,null,null,null,{"$f":"Verbraucher!B46","v":"Relevé de situation V37"},null,{"$f":"Text!C52","v":"Champs a remplir"}]
[null,null,null,null,null,null,{"$f":"Text!C37","v":"Format de fichier: .xlsm"}]

{"sheet":"AT-Vergleich","index":13,"n_rows":42,"n_cols":23,"rows_kept":42,"cut":false,"hidden":false,"merged":[[37,0,37,6],[46,0,46,6]]}
[]
[null,null,null,null,null,null,null,null,null,null,null,null,null,null,null,null,"Schweiz (CH, 2002 - 2011)",null,null,null,null,null,"Österreich (AT, 2002 - 2011)"]
[null,null,null,null,null,null,null,null,null,null,null,null,null,"Off",null,"On","Andermatt (CH), 1442 m ü. M.",null,null,"Off",null,"On","Bad Aussee (AT), 659 m ü. M."]
[null,null,null,null,null,null,null,null,null,null,null,null,null,"Off",null,"On","Acquarossa/Comprovasco (CH), 575 m ü. M.",null,null,"Off",null,"On","Bregenz (AT), 427 m ü. M."]
[null,null,null,null,null,null,null,null,null,null,null,null,null,"Off",null,"On","Bad Ragaz (CH), 496 m ü. M.",null,null,"Off",null,"On","Eisenstadt (AT), 182 m ü. M."]
[null,null,null,null,null,null,null,null,null,null,null,null,null,"Off",null,"On","Basel-Binningen (CH), 316 m ü. M.",null,null,"Off",null,"On","Freistadt (AT), 560 m ü. M."]
[null,null,null,null,null,null,null,null,null,null,null,null,null,"Off",null,"On","Bern/Zollikofen (CH), 553 m ü. M.",null,null,"Off",null,"On","Fürstenfeld (AT), 276 m ü. M."]
[null,null,null,null,null,null,null,null,null,null,null,null,null,"Off",null,"On","Bullet / La Fretaz (CH), 1205 m ü. M.",null,null,"Off",null,"On","Graz Universität (AT), 353 m ü. M."]
[null,null,null,null,null,null,null,null,null,null,null,null,null,"Off",null,"On","Château-d'Oex (CH), 1029 m ü. M.",null,null,"Off",null,"On","Hohenau/March (AT), 155 m ü. M."]
[null,null,null,null,null,null,null,null,null,null,null,null,null,"Off",null,"On","Davos (CH), 1594 m ü. M.",null,null,"Off",null,"On","Innsbruck Universität (AT), 574 m ü. M."]
[null,null,null,null,null,null,null,null,null,null,null,null,null,"Off",null,"On","Disentis/Sedrun (CH), 1197 m ü. M.",null,null,"Off",null,"On","Klagenfurt Flughafen (AT), 446 m ü. M."]
[null,null,null,null,null,null,null,null,null,null,null,null,null,"Off",null,"On","Einsiedeln (CH), 910 m ü. M.",null,null,"Off",null,"On","Kufstein (AT), 499 m ü. M."]
[null,null,null,null,null,null,null,null,null,null,null,null,null,"Off",null,"On","Engelberg (CH), 1036 m ü. M.",null,null,"Off",null,"On","Lienz (AT), 673 m ü. M."]
[null,null,null,null,null,null,null,null,null,null,null,null,null,"Off",null,"On","Fribourg/Posieux (CH), 646 m ü. M.",null,null,"Off",null,"On","Linz Stadt (AT), 266 m ü. M."]
[null,null,null,null,null,null,null,null,null,null,null,null,null,"Off",null,"On","La Chaux-de-Fonds (CH), 1018 m ü. M.",null,null,"Off",null,"On","Mariazell (AT), 868 m ü. M."]
[null,null,null,null,null,null,null,null,null,null,null,null,null,"Off",null,"On","Langnau i.E. (CH), 745 m ü. M.",null,null,"Off",null,"On","Salzburg-Freisaal (AT), 424 m ü. M."]
[null,null,null,null,null,null,null,null,null,null,null,null,null,"Off",null,"On","Locarno/Monti (CH), 367 m ü. M.",null,null,"Off",null,"On","Schröcken (AT), 1269 m ü. M."]
[null,null,null,null,null,null,null,null,null,null,null,null,null,"Off",null,"On","Luzern (CH), 454 m ü. M.",null,null,"Off",null,"On","St. Pölten (AT), 267 m ü. M."]
[null,null,null,null,null,null,null,null,null,null,null,null,null,"Off",null,"On","Payerne (CH), 490 m ü. M.",null,null,"Off",null,"On","Tamsweg (AT), 1022 m ü. M."]
[null,null,null,null,null,null,null,null,null,null,null,null,null,"Off",null,"On","Piotta (CH), 990 m ü. M.",null,null,"Off",null,"On","Wien innere Stadt (AT), 170 m ü. M."]
[null,null,null,null,null,null,null,null,null,null,null,null,null,"Off",null,"On","Pully (CH), 456 m ü. M.",null,null,"Off",null,"On","Zell am See (AT), 750 m ü. M."]
[null,null,null,null,null,null,null,null,null,null,null,null,null,"Off",null,"On","Rünenberg (CH), 611 m ü. M.",null,null,"Off",null,"On","Zeltweg (AT), 659 m ü. M."]
[null,null,null,null,null,null,null,null,null,null,null,null,null,"Off",null,"On","Samedan (CH), 1709 m ü. M."]
[null,null,null,null,null,null,null,null,null,null,null,null,null,"Off",null,"On","St. Gallen (CH), 776 m ü. M."]
[null,null,null,null,null,null,null,null,null,null,null,null,null,"Off",null,"On","Ulrichen (CH), 1346 m ü. M.",null,null,null,null,null,"Slowenien (SI, 1993 - 2002)"]
[null,null,null,null,null,null,null,null,null,null,null,null,null,"Off",null,"On","Visp (CH), 639 m ü. M.",null,null,"Off",null,"On","BILJE (SI), 55 m ü. M."]
[null,null,null,null,null,null,null,null,null,null,null,null,null,"Off",null,"On","Zürich/Fluntern (CH), 556 m ü. M.",null,null,"Off",null,"On","BRNIK LETALIŠČE (SI), 364 m ü. M."]
[null,null,null,null,null,null,null,null,null,null,null,null,null,null,null,null,null,null,null,"Off",null,"On","NOVA VAS [BLOKE] (SI), 722 m ü. M."]
[]
[null,null,null,null,null,null,null,null,null,null,null,null,null,null,null,null,"Deutschland (DE, 2002 - 2011)"]
[null,null,null,null,null,null,null,null,null,null,null,null,null,"Off",null,"On","Augsburg (DE), 461 m ü. M.",null,null,null,null,null,"Italien (IT, 2011 - 2020)"]
[null,null,null,null,null,null,null,null,null,null,null,null,null,"Off",null,"On","Bamberg (DE), 240 m ü. M.",null,null,"Off",null,"On","Barcis (IT) 409 m s.l.m."]
[null,null,null,null,null,null,null,null,null,null,null,null,null,"Off",null,"On","Frankfurt/Main Flughafen (DE), 112 m ü. M.",null,null,"Off",null,"On","Codroipo (IT) 43 m s.l.m."]
[null,null,null,null,null,null,null,null,null,null,null,null,null,"Off",null,"On","Hof (DE), 565 m ü. M.",null,null,"Off",null,"On","Forni di Sopra (IT) 907 m s.l.m."]
[null,null,null,null,null,null,null,null,null,null,null,null,null,"Off",null,"On","Hohenpeißenberg (DE), 977 m ü. M.",null,null,"Off",null,"On","Gemona (IT) 272 m s.l.m."]
[null,null,null,null,null,null,null,null,null,null,null,null,null,"Off",null,"On","Kahler Asten (DE), 839 m ü. M.",null,null,"Off",null,"On","San Pietro al Nasitone (IT) 175 m s.l.m."]
[null,null,null,null,null,null,null,null,null,null,null,null,null,"Off",null,"On","Karlsruhe/Rheinstetten (DE), 116 m ü. M.",null,null,"Off",null,"On","Sgonico (IT) 278 m s.l.m."]
[null,null,null,null,null,null,null,null,null,null,null,null,null,"Off",null,"On","Kempten (DE), 705 m ü. M.",null,null,"Off",null,"On","Tarvisio (IT) 754 m s.l.m."]
[null,null,null,null,null,null,null,null,null,null,null,null,null,"Off",null,"On","München Flughafen (DE), 446 m ü. M.",null,null,"Off",null,"On","Tolmezzo (IT) 323 m s.l.m."]
[null,null,null,null,null,null,null,null,null,null,null,null,null,"Off",null,"On","Nürnberg (DE), 314 m ü. M."]
[null,null,null,null,null,null,null,null,null,null,null,null,null,"Off",null,"On","Trier-Petrisberg (DE), 265 m ü. M."]
[null,null,null,null,null,null,null,null,null,null,null,null,null,"Off",null,"On","Würzburg (DE), 268 m ü. M."]

{"sheet":"Aenderungsprotokoll","index":14,"n_rows":13,"n_cols":4,"rows_kept":13,"cut":false,"hidden":true,"merged":[]}
["Datum","Version","Aenderung","Wer"]
["2016-10-21","V34","Neue Versionsnummer vergeben; Von V33 auf V34;","ST"]
[null,"V34","Q-Plan Tabelle als Mappe ergänzt","ST"]
["2016-10-25","V34","an Q-Plan Tabelle weitergearbeitet","ST"]
[null,null,"Deutsche und Französiche Version in einer Mappe","ST"]
["2018-08-13","V35","Berechnung Silovolumen und Bewertung mit Pellets in der Mappe Q-Plan korrigiert (Zelle D54): Schüttdichte von Pellets ergänzt","ST"]
["2018-08-13","V35","Zielwert Silogrösse bei Hackschnitzel in der Mappe Q-Plan korrigiert (Zelle B54): Abdeckung von 6-7 Tage auf 5-7 tage korrigiert","ST"]
["2021-01-31","V36","Neue Version 36 erstellt","ST"]
["2021-01-31","V36","Text für Italienisch und Englisch übernommen und angepasst","ST"]
["2021-01-31","V36","Bilder auf Italienisch und Englisch erstellt","ST"]
["2021-12-03","V37","Makro zur Umschaltung der Tabellenblattnamen und Einblenden des jeweiligen Bilder-Blatts nach ausgewählter Sprache","CRa"]
["2021-12-15","V37","Klimadaten Italien ergänzt","ST"]
["2022-08-17","V37-06","Englische Texte auf Hinweis CR geändert","ST"]